Uploaded image for project: 'Maven Surefire'
  1. Maven Surefire
  2. SUREFIRE-909

Wrong elapsed time calculation

    XMLWordPrintableJSON

    Details

    • Type: Bug
    • Status: Closed
    • Priority: Major
    • Resolution: Fixed
    • Affects Version/s: 2.12.3
    • Fix Version/s: 2.12.4
    • Component/s: Junit 4.x support
    • Labels:
      None
    • Environment:
      linux, likely others

      Description

      It's a regression in 2.12.3 vs. the previous versions.
      See "Time elapsed: 251992 sec"

      2.12.3
      Running my.Test
      Tests run: 1, Failures: 1, Errors: 0, Skipped: 0, Time elapsed: 252.358 sec <<< FAILURE!
      test(my.Test) Time elapsed: 251992 sec <<< FAILURE!
      java.lang.AssertionError: expected array was null

      2.10 or 2.11 or 2.12.1 or 2.12.2
      Tests run: 1, Failures: 1, Errors: 0, Skipped: 0, Time elapsed: 252.444 sec <<< FAILURE!
      test(my.Test) Time elapsed: 252.194 sec <<< FAILURE!
      java.lang.AssertionError: expected array was null

        Attachments

          Activity

            People

            • Assignee:
              krosenvold Kristian Rosenvold
              Reporter:
              nkeywal Nicolas Liochon
            • Votes:
              1 Vote for this issue
              Watchers:
              3 Start watching this issue

              Dates

              • Created:
                Updated:
                Resolved: