Uploaded image for project: 'Maven Surefire'
  1. Maven Surefire
  2. SUREFIRE-1732

ForkedProcessEvent class was missing while executing org.apache.maven.plugins:maven-surefire-plugin

    XMLWordPrintableJSON

    Details

    • Type: Bug
    • Status: Open
    • Priority: Major
    • Resolution: Unresolved
    • Affects Version/s: 3.0.0-M4
    • Fix Version/s: None
    • Component/s: Maven Surefire Plugin
    • Labels:
      None

      Description

      [ERROR] Failed to execute goal org.apache.maven.plugins:maven-surefire-plugin:3.0.0-M4:test (default-test) on project idgenerator: Execution default-test of goal org.apache.maven.plugins:maven-surefire-plugin:3.0.0-M4:test failed: A required class was missing while executing org.apache.maven.plugins:maven-surefire-plugin:3.0.0-M4:test: org/apache/maven/surefire/booter/ForkedProcessEvent [ERROR] ----------------------------------------------------- [ERROR] realm = plugin>org.apache.maven.plugins:maven-surefire-plugin:3.0.0-M4 [ERROR] strategy = org.codehaus.plexus.classworlds.strategy.SelfFirstStrategy [ERROR] urls[0] = file:/var/lib/jenkins/.m2/repository/org/apache/maven/plugins/maven-surefire-plugin/3.0.0-M4/maven-surefire-plugin-3.0.0-M4.jar [ERROR] urls[1] = file:/var/lib/jenkins/.m2/repository/org/apache/maven/surefire/surefire-junit4/2.22.1/surefire-junit4-2.22.1.jar [ERROR] urls[2] = file:/var/lib/jenkins/.m2/repository/org/apache/maven/surefire/surefire-api/2.22.1/surefire-api-2.22.1.jar [ERROR] urls[3] = file:/var/lib/jenkins/.m2/repository/org/apache/maven/surefire/surefire-logger-api/2.22.1/surefire-logger-api-2.22.1.jar [ERROR] urls[4] = file:/var/lib/jenkins/.m2/repository/org/apache/maven/surefire/maven-surefire-common/3.0.0-M4/maven-surefire-common-3.0.0-M4.jar [ERROR] urls[5] = file:/var/lib/jenkins/.m2/repository/org/apache/maven/surefire/surefire-extensions-api/3.0.0-M4/surefire-extensions-api-3.0.0-M4.jar [ERROR] urls[6] = file:/var/lib/jenkins/.m2/repository/org/apache/maven/surefire/surefire-booter/3.0.0-M4/surefire-booter-3.0.0-M4.jar [ERROR] urls[7] = file:/var/lib/jenkins/.m2/repository/org/apache/maven/shared/maven-artifact-transfer/0.11.0/maven-artifact-transfer-0.11.0.jar [ERROR] urls[8] = file:/var/lib/jenkins/.m2/repository/org/apache/maven/shared/maven-common-artifact-filters/3.1.0/maven-common-artifact-filters-3.1.0.jar [ERROR] urls[9] = file:/var/lib/jenkins/.m2/repository/org/sonatype/sisu/sisu-inject-bean/1.4.2/sisu-inject-bean-1.4.2.jar [ERROR] urls[10] = file:/var/lib/jenkins/.m2/repository/org/sonatype/sisu/sisu-guice/2.1.7/sisu-guice-2.1.7-noaop.jar [ERROR] urls[11] = file:/var/lib/jenkins/.m2/repository/commons-codec/commons-codec/1.11/commons-codec-1.11.jar [ERROR] urls[12] = file:/var/lib/jenkins/.m2/repository/org/codehaus/plexus/plexus-java/1.0.3/plexus-java-1.0.3.jar [ERROR] urls[13] = file:/var/lib/jenkins/.m2/repository/org/ow2/asm/asm/7.0/asm-7.0.jar [ERROR] urls[14] = file:/var/lib/jenkins/.m2/repository/com/thoughtworks/qdox/qdox/2.0-M9/qdox-2.0-M9.jar [ERROR] urls[15] = file:/var/lib/jenkins/.m2/repository/org/codehaus/plexus/plexus-utils/1.1/plexus-utils-1.1.jar [ERROR] Number of foreign imports: 1 [ERROR] import: Entry[import from realm ClassRealm[maven.api, parent: null]] [ERROR] [ERROR] -----------------------------------------------------: org.apache.maven.surefire.booter.ForkedProcessEvent

        Attachments

          Activity

            People

            • Assignee:
              Unassigned
              Reporter:
              jaina Akanksha Jain
            • Votes:
              1 Vote for this issue
              Watchers:
              4 Start watching this issue

              Dates

              • Created:
                Updated: