Details

    • Type: Test
    • Status: Closed
    • Priority: Trivial
    • Resolution: Not A Problem
    • Affects Version/s: None
    • Fix Version/s: 0.5
    • Component/s: None
    • Labels:
      None

      Description

      Hello~
      I'm new on Streams. Nice to meet you.
      Though, I'm stuck on 'mvn clean package'. This is the log.

      ...
      [INFO] ------------------------------------------------------------------------
      [INFO] BUILD FAILURE
      [INFO] ------------------------------------------------------------------------
      [INFO] Total time: 01:03 min
      [INFO] Finished at: 2017-02-06T23:35:57+09:00
      [INFO] Final Memory: 83M/816M
      [INFO] ------------------------------------------------------------------------
      [ERROR] Failed to execute goal org.apache.maven.plugins:maven-surefire-plugin:2.19.1:test (default-test) on project streams-pojo: There are test failures.
      [ERROR]
      [ERROR] Please refer to /Users/kwangin/workspace/incubator-streams/streams-pojo/target/surefire-reports for the individual test results.
      [ERROR] -> [Help 1]
      org.apache.maven.lifecycle.LifecycleExecutionException: Failed to execute goal org.apache.maven.plugins:maven-surefire-plugin:2.19.1:test (default-test) on project streams-pojo: There are test failures.

      Please refer to /Users/kwangin/workspace/incubator-streams/streams-pojo/target/surefire-reports for the individual test results.
      at org.apache.maven.lifecycle.internal.MojoExecutor.execute(MojoExecutor.java:212)
      at org.apache.maven.lifecycle.internal.MojoExecutor.execute(MojoExecutor.java:153)
      at org.apache.maven.lifecycle.internal.MojoExecutor.execute(MojoExecutor.java:145)
      at org.apache.maven.lifecycle.internal.LifecycleModuleBuilder.buildProject(LifecycleModuleBuilder.java:116)
      at org.apache.maven.lifecycle.internal.LifecycleModuleBuilder.buildProject(LifecycleModuleBuilder.java:80)
      at org.apache.maven.lifecycle.internal.builder.singlethreaded.SingleThreadedBuilder.build(SingleThreadedBuilder.java:51)
      at org.apache.maven.lifecycle.internal.LifecycleStarter.execute(LifecycleStarter.java:128)
      at org.apache.maven.DefaultMaven.doExecute(DefaultMaven.java:307)
      at org.apache.maven.DefaultMaven.doExecute(DefaultMaven.java:193)
      at org.apache.maven.DefaultMaven.execute(DefaultMaven.java:106)
      at org.apache.maven.cli.MavenCli.execute(MavenCli.java:863)
      at org.apache.maven.cli.MavenCli.doMain(MavenCli.java:288)
      at org.apache.maven.cli.MavenCli.main(MavenCli.java:199)
      at sun.reflect.NativeMethodAccessorImpl.invoke0(Native Method)
      at sun.reflect.NativeMethodAccessorImpl.invoke(NativeMethodAccessorImpl.java:62)
      at sun.reflect.DelegatingMethodAccessorImpl.invoke(DelegatingMethodAccessorImpl.java:43)
      at java.lang.reflect.Method.invoke(Method.java:498)
      at org.codehaus.plexus.classworlds.launcher.Launcher.launchEnhanced(Launcher.java:289)
      at org.codehaus.plexus.classworlds.launcher.Launcher.launch(Launcher.java:229)
      at org.codehaus.plexus.classworlds.launcher.Launcher.mainWithExitCode(Launcher.java:415)
      at org.codehaus.plexus.classworlds.launcher.Launcher.main(Launcher.java:356)
      Caused by: org.apache.maven.plugin.MojoFailureException: There are test failures.

      Please refer to /Users/kwangin/workspace/incubator-streams/streams-pojo/target/surefire-reports for the individual test results.
      at org.apache.maven.plugin.surefire.SurefireHelper.reportExecution(SurefireHelper.java:91)
      at org.apache.maven.plugin.surefire.SurefirePlugin.handleSummary(SurefirePlugin.java:320)
      at org.apache.maven.plugin.surefire.AbstractSurefireMojo.executeAfterPreconditionsChecked(AbstractSurefireMojo.java:892)
      at org.apache.maven.plugin.surefire.AbstractSurefireMojo.execute(AbstractSurefireMojo.java:755)
      at org.apache.maven.plugin.DefaultBuildPluginManager.executeMojo(DefaultBuildPluginManager.java:134)
      at org.apache.maven.lifecycle.internal.MojoExecutor.execute(MojoExecutor.java:207)
      ... 20 more
      [ERROR]
      [ERROR] Re-run Maven using the -X switch to enable full debug logging.
      [ERROR]
      [ERROR] For more information about the errors and possible solutions, please read the following articles:
      [ERROR] [Help 1] http://cwiki.apache.org/confluence/display/MAVEN/MojoFailureException
      [ERROR]
      [ERROR] After correcting the problems, you can resume the build with the command
      [ERROR] mvn <goals> -rf :streams-pojo
      ...
      Does anybody know about it?

        Attachments

          Activity

            People

            • Assignee:
              Unassigned
              Reporter:
              djkooks Kwang-in (Dennis) JUNG
            • Votes:
              0 Vote for this issue
              Watchers:
              3 Start watching this issue

              Dates

              • Created:
                Updated:
                Resolved: