Uploaded image for project: 'Apache Storm'
  1. Apache Storm
  2. STORM-751

Move javadoc aggregate to site phase.

    XMLWordPrintableJSON

    Details

    • Type: Bug
    • Status: Closed
    • Priority: Critical
    • Resolution: Fixed
    • Affects Version/s: 0.10.0
    • Fix Version/s: 0.10.0, 1.0.0
    • Component/s: storm-hbase
    • Labels:
      None
    • Environment:
      Storm build fails in package phase, as javadoc aggregate looks for storm-core, which is not built.

      Description

      [INFO] ------------------------------------------------------------------------
      [INFO] Reactor Summary:
      [INFO] 
      [INFO] Storm ............................................. FAILURE [5.904s]
      [INFO] maven-shade-clojure-transformer ................... SKIPPED
      [INFO] storm-maven-plugins ............................... SKIPPED
      [INFO] Storm Core ........................................ SKIPPED
      [INFO] storm-starter ..................................... SKIPPED
      [INFO] storm-kafka ....................................... SKIPPED
      [INFO] storm-hdfs ........................................ SKIPPED
      [INFO] storm-hbase ....................................... SKIPPED
      [INFO] storm-hive ........................................ SKIPPED
      [INFO] storm-jdbc ........................................ SKIPPED
      [INFO] storm-redis ....................................... SKIPPED
      [INFO] Storm JMS ......................................... SKIPPED
      [INFO] Storm Cassandra Support ........................... SKIPPED
      [INFO] Storm Binary Distribution ......................... SKIPPED
      [INFO] Storm Source Distribution ......................... SKIPPED
      [INFO] ------------------------------------------------------------------------
      [INFO] BUILD FAILURE
      [INFO] ------------------------------------------------------------------------
      [INFO] Total time: 6.826s
      [INFO] Finished at: Fri Apr 03 14:12:15 EDT 2015
      [INFO] Final Memory: 40M/2474M
      [INFO] ------------------------------------------------------------------------
      [ERROR] Failed to execute goal on project storm-kafka: Could not resolve dependencies for project org.apache.storm:storm-kafka:jar:0.10.0.2.3.0.0-1493: Could not find artifact org.apache.storm:storm-core:jar:0.10.0.2.3.0.0-1493 in public
      
      

        Attachments

          Activity

            People

            • Assignee:
              ashishujjain Ashish Singh
              Reporter:
              ashishujjain Ashish Singh
            • Votes:
              0 Vote for this issue
              Watchers:
              3 Start watching this issue

              Dates

              • Created:
                Updated:
                Resolved: