Uploaded image for project: 'Apache Storm'
  1. Apache Storm
  2. STORM-2522

examples in package do not build with checkstyle issues

    Details

    • Type: Bug
    • Status: Resolved
    • Priority: Major
    • Resolution: Fixed
    • Affects Version/s: 2.0.0
    • Fix Version/s: 2.0.0
    • Component/s: None
    • Labels:
      None

      Description

      $ mvn clean package
      [INFO] Scanning for projects...
      [INFO]
      [INFO] ------------------------------------------------------------------------
      [INFO] Building storm-starter 2.0.0-SNAPSHOT
      [INFO] ------------------------------------------------------------------------
      [INFO]
      [INFO] --- maven-clean-plugin:2.5:clean (default-clean) @ storm-starter ---
      [INFO]
      [INFO] --- maven-clean-plugin:2.5:clean (cleanup) @ storm-starter ---
      [INFO]
      [INFO] --- maven-checkstyle-plugin:2.17:check (validate) @ storm-starter ---
      [INFO] ------------------------------------------------------------------------
      [INFO] BUILD FAILURE
      [INFO] ------------------------------------------------------------------------
      [INFO] Total time: 1.468 s
      [INFO] Finished at: 2017-05-18T15:58:20-05:00
      [INFO] Final Memory: 26M/437M
      [INFO] ------------------------------------------------------------------------
      [ERROR] Failed to execute goal org.apache.maven.plugins:maven-checkstyle-plugin:2.17:check (validate) on project storm-starter: Failed during checkstyle execution: Unable to find configuration file at location: storm-buildtools/storm_checkstyle.xml: Could not find resource 'storm-buildtools/storm_checkstyle.xml'. -> [Help 1]
      [ERROR]
      [ERROR] To see the full stack trace of the errors, re-run Maven with the -e switch.
      [ERROR] Re-run Maven using the -X switch to enable full debug logging.
      [ERROR]
      [ERROR] For more information about the errors and possible solutions, please read the following articles:
      [ERROR] [Help 1] http://cwiki.apache.org/confluence/display/MAVEN/MojoExecutionException
      

        Attachments

          Activity

            People

            • Assignee:
              kabhwan Jungtaek Lim
              Reporter:
              revans2 Robert Joseph Evans
            • Votes:
              0 Vote for this issue
              Watchers:
              2 Start watching this issue

              Dates

              • Created:
                Updated:
                Resolved: