Uploaded image for project: 'Apache Storm'
  1. Apache Storm
  2. STORM-915 Track and resolve any further random tests failure
  3. STORM-1436

Random test failure on BlobStoreTest / HdfsBlobStoreImplTest (occasionally killed)

    XMLWordPrintableJSON

    Details

    • Type: Sub-task
    • Status: Resolved
    • Priority: Critical
    • Resolution: Fixed
    • Affects Version/s: None
    • Fix Version/s: 2.0.0
    • Component/s: storm-hdfs
    • Labels:
      None

      Description

      I'm occasionally seeing those failures which seems to be bad.

      Running org.apache.storm.hdfs.blobstore.BlobStoreTest
      Killed
      
          [ERROR] Failed to execute goal org.apache.maven.plugins:maven-surefire-plugin:2.18.1:test (default-test) on project storm-hdfs: Execution default-test of goal org.apache.maven.plugins:maven-surefire-plugin:2.18.1:test failed: The forked VM terminated without properly saying goodbye. VM crash or System.exit called?
      [ERROR] Command was /bin/sh -c cd /home/travis/build/apache/storm/external/storm-hdfs && /usr/lib/jvm/java-7-oracle/jre/bin/java -jar /home/travis/build/apache/storm/external/storm-hdfs/target/surefire/surefirebooter8236170494011505678.jar /home/travis/build/apache/storm/external/storm-hdfs/target/surefire/surefire1381626990211210932tmp /home/travis/build/apache/storm/external/storm-hdfs/target/surefire/surefire_13793819195712665660tmp
      

      and

      Running org.apache.storm.hdfs.blobstore.HdfsBlobStoreImplTest
      Killed
      
      [ERROR] Failed to execute goal org.apache.maven.plugins:maven-surefire-plugin:2.18.1:test (default-test) on project storm-hdfs: Execution default-test of goal org.apache.maven.plugins:maven-surefire-plugin:2.18.1:test failed: The forked VM terminated without properly saying goodbye. VM crash or System.exit called?
      [ERROR] Command was /bin/sh -c cd /home/travis/build/apache/storm/external/storm-hdfs && /usr/lib/jvm/java-7-oracle/jre/bin/java -jar /home/travis/build/apache/storm/external/storm-hdfs/target/surefire/surefirebooter5805029835719201606.jar /home/travis/build/apache/storm/external/storm-hdfs/target/surefire/surefire8308399860998357106tmp /home/travis/build/apache/storm/external/storm-hdfs/target/surefire/surefire_14972550451446562529tmp
      [ERROR] -> [Help 1]
      [ERROR] 
      [ERROR] To see the full stack trace of the errors, re-run Maven with the -e switch.
      [ERROR] Re-run Maven using the -X switch to enable full debug logging.
      [ERROR] 
      [ERROR] For more information about the errors and possible solutions, please read the following articles:
      [ERROR] [Help 1] http://cwiki.apache.org/confluence/display/MAVEN/PluginExecutionException
      [ERROR] 
      [ERROR] After correcting the problems, you can resume the build with the command
      [ERROR]   mvn <goals> -rf :storm-hdfs
      

        Attachments

          Activity

            People

            • Assignee:
              revans2 Robert Joseph Evans
              Reporter:
              kabhwan Jungtaek Lim
            • Votes:
              0 Vote for this issue
              Watchers:
              3 Start watching this issue

              Dates

              • Created:
                Updated:
                Resolved: