Stanbol
  1. Stanbol
  2. STANBOL-957

Cannot build Stanbol (Trunk) on Windows 8 / Maven 3.0.4

    Details

    • Type: Bug Bug
    • Status: Resolved
    • Priority: Blocker Blocker
    • Resolution: Fixed
    • Affects Version/s: None
    • Fix Version/s: 0.12.0
    • Component/s: Build
    • Labels:
      None
    • Environment:
      Windows 8, Maven 3.0.4,

      Description

      Hi!

      Following the Getting Started guide at http://stanbol.apache.org/docs/trunk/tutorial.html, my build fails with the following error:

      C:\lib\stanbol>mvn clean install
      [INFO] Scanning for projects...
      [ERROR] The build could not read 1 project -> [Help 1]
      [ERROR]
      [ERROR] The project org.apache.stanbol:apache-stanbol-enhancement-engines:0.10
      .1-SNAPSHOT (C:\lib\stanbol\enhancement-engines\pom.xml) has 1 error
      [ERROR] Non-resolvable parent POM: Could not find artifact org.apache.stanbo
      l:stanbol-parent:pom:4-SNAPSHOT and 'parent.relativePath' points at wrong local
      POM @ line 21, column 11 -> [Help 2]
      [ERROR]
      [ERROR] To see the full stack trace of the errors, re-run Maven with the -e swit
      ch.
      [ERROR] Re-run Maven using the -X switch to enable full debug logging.
      [ERROR]
      [ERROR] For more information about the errors and possible solutions, please rea
      d the following articles:
      [ERROR] [Help 1] http://cwiki.apache.org/confluence/display/MAVEN/ProjectBuildin
      gException
      [ERROR] [Help 2] http://cwiki.apache.org/confluence/display/MAVEN/UnresolvableMo
      delException
      C:\lib\stanbol>

      So i tried resolving it by changing the relative path in the affected pom from
      <parent>
      <groupId>org.apache.stanbol</groupId>
      <artifactId>stanbol-parent</artifactId>
      <version>4-SNAPSHOT</version>
      </parent>

      to

      <parent>
      <groupId>org.apache.stanbol</groupId>
      <artifactId>stanbol-parent</artifactId>
      <version>4-SNAPSHOT</version>
      <relativePath>../parent/pom.xml</relativePath>
      </parent>

      and that resolved the specific error, but the next build attempt were followed by the same error in the following pom and i'm thinking i'm missing something trivial here - all the project's paths cannot be erronous, right?

        Issue Links

          Activity

          Hide
          Rupert Westenthaler added a comment -

          This is caused by some left overs of the enhancement-eninges release (STANBOL-913). Also reported for STANBOL-941 (see also attached patches).

          The following information in build artifacts where not correctly updated

          • All none release engines where missing in enhancement-enines reactor pom.xml
          • metaxa engine, refactor engine and the disambiguation-mlt
          • parent pom version not updated for those three engines
          • parent pom not updated in enhancer bundle list
          • to avoid this I will change the parent of all bundlelists to the bundlelist parent.
          • missing version updates in the lanugage-extras bundle lists
          • for both the commons 0.11.0 and the enhancement-enines 0.10.0 releases
          Show
          Rupert Westenthaler added a comment - This is caused by some left overs of the enhancement-eninges release ( STANBOL-913 ). Also reported for STANBOL-941 (see also attached patches). The following information in build artifacts where not correctly updated All none release engines where missing in enhancement-enines reactor pom.xml metaxa engine, refactor engine and the disambiguation-mlt parent pom version not updated for those three engines parent pom not updated in enhancer bundle list to avoid this I will change the parent of all bundlelists to the bundlelist parent. missing version updates in the lanugage-extras bundle lists for both the commons 0.11.0 and the enhancement-enines 0.10.0 releases
          Hide
          Rupert Westenthaler added a comment -

          should be fixed with http://svn.apache.org/r1449558. Can someone plz validate this.

          Show
          Rupert Westenthaler added a comment - should be fixed with http://svn.apache.org/r1449558 . Can someone plz validate this.
          Hide
          Oak Ninja added a comment - - edited

          Thank you Rupert - this issue seem to be resolved!

          I'm building right now, fingers crossed

          Could someone mark this issue as resolved? I'm not too familiar with Jira, don't know i'll do it right.

          Show
          Oak Ninja added a comment - - edited Thank you Rupert - this issue seem to be resolved! I'm building right now, fingers crossed Could someone mark this issue as resolved? I'm not too familiar with Jira, don't know i'll do it right.
          Hide
          Oak Ninja added a comment -

          Doesn't halt on pom error since build r1449558

          Show
          Oak Ninja added a comment - Doesn't halt on pom error since build r1449558
          Hide
          Oak Ninja added a comment -

          Got another build error:

          [INFO] BUILD FAILURE
          [INFO] ------------------------------------------------------------------------
          [INFO] Total time: 18:57.347s
          [INFO] Finished at: Mon Feb 25 00:11:21 CET 2013
          [INFO] Final Memory: 356M/718M
          [INFO] ------------------------------------------------------------------------
          [ERROR] Failed to execute goal org.apache.maven.plugins:maven-surefire-plugin:2.
          11:test (default-test) on project org.apache.stanbol.enhancer.engine.topic: Ther
          e are test failures.
          [ERROR]
          [ERROR] Please refer to C:\Dev\Project\Stanbol\enhancement-engines\topic\engine\
          target\surefire-reports for the individual test results.
          [ERROR] -> [Help 1]
          [ERROR]
          [ERROR] To see the full stack trace of the errors, re-run Maven with the -e swit
          ch.
          [ERROR] Re-run Maven using the -X switch to enable full debug logging.
          [ERROR]
          [ERROR] For more information about the errors and possible solutions, please rea
          d the following articles:
          [ERROR] [Help 1] http://cwiki.apache.org/confluence/display/MAVEN/MojoFailureExc
          eption
          [ERROR]
          [ERROR] After correcting the problems, you can resume the build with the command

          [ERROR] mvn <goals> -rf :org.apache.stanbol.enhancer.engine.topic
          C:\Dev\Project\Stanbol>

          Trying to build skipping tests, if that doesn't work i'll open a new ticket.

          Show
          Oak Ninja added a comment - Got another build error: [INFO] BUILD FAILURE [INFO] ------------------------------------------------------------------------ [INFO] Total time: 18:57.347s [INFO] Finished at: Mon Feb 25 00:11:21 CET 2013 [INFO] Final Memory: 356M/718M [INFO] ------------------------------------------------------------------------ [ERROR] Failed to execute goal org.apache.maven.plugins:maven-surefire-plugin:2. 11:test (default-test) on project org.apache.stanbol.enhancer.engine.topic: Ther e are test failures. [ERROR] [ERROR] Please refer to C:\Dev\Project\Stanbol\enhancement-engines\topic\engine\ target\surefire-reports for the individual test results. [ERROR] -> [Help 1] [ERROR] [ERROR] To see the full stack trace of the errors, re-run Maven with the -e swit ch. [ERROR] Re-run Maven using the -X switch to enable full debug logging. [ERROR] [ERROR] For more information about the errors and possible solutions, please rea d the following articles: [ERROR] [Help 1] http://cwiki.apache.org/confluence/display/MAVEN/MojoFailureExc eption [ERROR] [ERROR] After correcting the problems, you can resume the build with the command [ERROR] mvn <goals> -rf :org.apache.stanbol.enhancer.engine.topic C:\Dev\Project\Stanbol> Trying to build skipping tests, if that doesn't work i'll open a new ticket.
          Hide
          Oak Ninja added a comment -

          Got a new build error:

          [INFO] BUILD FAILURE
          [INFO] ------------------------------------------------------------------------
          [INFO] Total time: 18:57.347s
          [INFO] Finished at: Mon Feb 25 00:11:21 CET 2013
          [INFO] Final Memory: 356M/718M
          [INFO] ------------------------------------------------------------------------
          [ERROR] Failed to execute goal org.apache.maven.plugins:maven-surefire-plugin:2.
          11:test (default-test) on project org.apache.stanbol.enhancer.engine.topic: Ther
          e are test failures.
          [ERROR]
          [ERROR] Please refer to C:\Dev\Project\Stanbol\enhancement-engines\topic\engine\
          target\surefire-reports for the individual test results.
          [ERROR] -> [Help 1]
          [ERROR]
          [ERROR] To see the full stack trace of the errors, re-run Maven with the -e swit
          ch.
          [ERROR] Re-run Maven using the -X switch to enable full debug logging.
          [ERROR]
          [ERROR] For more information about the errors and possible solutions, please rea
          d the following articles:
          [ERROR] [Help 1] http://cwiki.apache.org/confluence/display/MAVEN/MojoFailureExc
          eption
          [ERROR]
          [ERROR] After correcting the problems, you can resume the build with the command

          [ERROR] mvn <goals> -rf :org.apache.stanbol.enhancer.engine.topic
          C:\Dev\Project\Stanbol>

          Show
          Oak Ninja added a comment - Got a new build error: [INFO] BUILD FAILURE [INFO] ------------------------------------------------------------------------ [INFO] Total time: 18:57.347s [INFO] Finished at: Mon Feb 25 00:11:21 CET 2013 [INFO] Final Memory: 356M/718M [INFO] ------------------------------------------------------------------------ [ERROR] Failed to execute goal org.apache.maven.plugins:maven-surefire-plugin:2. 11:test (default-test) on project org.apache.stanbol.enhancer.engine.topic: Ther e are test failures. [ERROR] [ERROR] Please refer to C:\Dev\Project\Stanbol\enhancement-engines\topic\engine\ target\surefire-reports for the individual test results. [ERROR] -> [Help 1] [ERROR] [ERROR] To see the full stack trace of the errors, re-run Maven with the -e swit ch. [ERROR] Re-run Maven using the -X switch to enable full debug logging. [ERROR] [ERROR] For more information about the errors and possible solutions, please rea d the following articles: [ERROR] [Help 1] http://cwiki.apache.org/confluence/display/MAVEN/MojoFailureExc eption [ERROR] [ERROR] After correcting the problems, you can resume the build with the command [ERROR] mvn <goals> -rf :org.apache.stanbol.enhancer.engine.topic C:\Dev\Project\Stanbol>
          Hide
          Rupert Westenthaler added a comment -

          I think this is related to STANBOL-811. Can you check

          > [ERROR] Please refer to C:\Dev\Project\Stanbol\enhancement-engines\topic\engine\
          > target\surefire-reports for the individual test results.

          and compare with the trace included in STANBOL-811.

          Show
          Rupert Westenthaler added a comment - I think this is related to STANBOL-811 . Can you check > [ERROR] Please refer to C:\Dev\Project\Stanbol\enhancement-engines\topic\engine\ > target\surefire-reports for the individual test results. and compare with the trace included in STANBOL-811 .
          Hide
          Oak Ninja added a comment -

          Yes, it seems to be the same error as STANBOL-811. See below for stacktrace.

          org.apache.stanbol.enhancer.topic.ClassifierException: org.apache.solr.common.SolrException
          at org.apache.stanbol.enhancer.engine.topic.TopicClassificationEngine.performCVFold(TopicClassificationEngine.java:1087)
          at org.apache.stanbol.enhancer.engine.topic.TopicClassificationEngine.updatePerformanceEstimates(TopicClassificationEngine.java:1043)
          at org.apache.stanbol.enhancer.engine.topic.TopicEngineTest.testCrossValidation(TopicEngineTest.java:483)
          at sun.reflect.NativeMethodAccessorImpl.invoke0(Native Method)
          at sun.reflect.NativeMethodAccessorImpl.invoke(NativeMethodAccessorImpl.java:39)
          at sun.reflect.DelegatingMethodAccessorImpl.invoke(DelegatingMethodAccessorImpl.java:25)
          at java.lang.reflect.Method.invoke(Method.java:597)
          at org.junit.runners.model.FrameworkMethod$1.runReflectiveCall(FrameworkMethod.java:47)
          at org.junit.internal.runners.model.ReflectiveCallable.run(ReflectiveCallable.java:12)
          at org.junit.runners.model.FrameworkMethod.invokeExplosively(FrameworkMethod.java:44)
          at org.junit.internal.runners.statements.InvokeMethod.evaluate(InvokeMethod.java:17)
          at org.junit.internal.runners.statements.RunBefores.evaluate(RunBefores.java:26)
          at org.junit.internal.runners.statements.RunAfters.evaluate(RunAfters.java:27)
          at org.junit.runners.ParentRunner.runLeaf(ParentRunner.java:271)
          at org.junit.runners.BlockJUnit4ClassRunner.runChild(BlockJUnit4ClassRunner.java:70)
          at org.junit.runners.BlockJUnit4ClassRunner.runChild(BlockJUnit4ClassRunner.java:50)
          at org.junit.runners.ParentRunner$3.run(ParentRunner.java:238)
          at org.junit.runners.ParentRunner$1.schedule(ParentRunner.java:63)
          at org.junit.runners.ParentRunner.runChildren(ParentRunner.java:236)
          at org.junit.runners.ParentRunner.access$000(ParentRunner.java:53)
          at org.junit.runners.ParentRunner$2.evaluate(ParentRunner.java:229)
          at org.junit.internal.runners.statements.RunBefores.evaluate(RunBefores.java:26)
          at org.junit.internal.runners.statements.RunAfters.evaluate(RunAfters.java:27)
          at org.junit.runners.ParentRunner.run(ParentRunner.java:309)
          at org.apache.maven.surefire.junit4.JUnit4Provider.execute(JUnit4Provider.java:234)
          at org.apache.maven.surefire.junit4.JUnit4Provider.executeTestSet(JUnit4Provider.java:133)
          at org.apache.maven.surefire.junit4.JUnit4Provider.invoke(JUnit4Provider.java:114)
          at sun.reflect.NativeMethodAccessorImpl.invoke0(Native Method)
          at sun.reflect.NativeMethodAccessorImpl.invoke(NativeMethodAccessorImpl.java:39)
          at sun.reflect.DelegatingMethodAccessorImpl.invoke(DelegatingMethodAccessorImpl.java:25)
          at java.lang.reflect.Method.invoke(Method.java:597)
          at org.apache.maven.surefire.util.ReflectionUtils.invokeMethodWithArray(ReflectionUtils.java:188)
          at org.apache.maven.surefire.booter.ProviderFactory$ProviderProxy.invoke(ProviderFactory.java:166)
          at org.apache.maven.surefire.booter.ProviderFactory.invokeProvider(ProviderFactory.java:86)
          at org.apache.maven.surefire.booter.ForkedBooter.runSuitesInProcess(ForkedBooter.java:101)
          at org.apache.maven.surefire.booter.ForkedBooter.main(ForkedBooter.java:74)
          Caused by: org.apache.solr.common.SolrException
          at org.apache.solr.core.SolrCore.<init>(SolrCore.java:600)
          at org.apache.solr.core.CoreContainer.create(CoreContainer.java:480)
          at org.apache.stanbol.enhancer.topic.EmbeddedSolrHelper.makeEmbeddedSolrServer(EmbeddedSolrHelper.java:84)
          at org.apache.stanbol.enhancer.engine.topic.TopicClassificationEngine.performCVFold(TopicClassificationEngine.java:1082)
          ... 35 more
          Caused by: java.lang.RuntimeException: org.apache.lucene.index.IndexNotFoundException: no segments* file found in org.apache.lucene.store.SimpleFSDirectory@C:\Users\Esse\AppData\Local\Temp\stanbol-evaluation-folder-6798239234465224100.tmp\evaluationclassifierserver\default-topic-model\data\index lockFactory=org.apache.lucene.store.NativeFSLockFactory@ac8360: files: [_b.fdt, _b.fdx, _b.frq, _b.prx, _b.tis, _b.tvd, _b.tvf, _b.tvx]
          at org.apache.solr.core.SolrCore.getSearcher(SolrCore.java:1104)
          at org.apache.solr.core.SolrCore.<init>(SolrCore.java:585)
          ... 38 more
          Caused by: org.apache.lucene.index.IndexNotFoundException: no segments* file found in org.apache.lucene.store.SimpleFSDirectory@C:\Users\Esse\AppData\Local\Temp\stanbol-evaluation-folder-6798239234465224100.tmp\evaluationclassifierserver\default-topic-model\data\index lockFactory=org.apache.lucene.store.NativeFSLockFactory@ac8360: files: [_b.fdt, _b.fdx, _b.frq, _b.prx, _b.tis, _b.tvd, _b.tvf, _b.tvx]
          at org.apache.lucene.index.SegmentInfos$FindSegmentsFile.run(SegmentInfos.java:667)
          at org.apache.lucene.index.DirectoryReader.open(DirectoryReader.java:72)
          at org.apache.lucene.index.IndexReader.open(IndexReader.java:375)
          at org.apache.solr.core.StandardIndexReaderFactory.newReader(StandardIndexReaderFactory.java:38)
          at org.apache.solr.core.SolrCore.getSearcher(SolrCore.java:1093)
          ... 39 more
          </error>
          <system-out>10:26:53,219 INFO TopicEngineTest:101 - Topic Enigne Test Folder : C:\Dev\Stanbol\enhancement-engines\topic\engine\target\enginetest-files
          10:26:53,688 WARN SolrConfig:148 - <indexDefaults> and <mainIndex> configuration sections are deprecated (but still work). Please use <indexConfig> instead.
          10:26:54,295 WARN SolrCore:395 - [test-topic-model] Solr index directory 'C:\Dev\Stanbol\enhancement-engines\topic\engine\target\enginetest-files\test1\classifierserver\test-topic-model\data\index' doesn't exist. Creating new index...
          10:26:55,107 WARN SolrConfig:148 - <indexDefaults> and <mainIndex> configuration sections are deprecated (but still work). Please use <indexConfig> instead.
          10:26:55,387 WARN SolrCore:395 - [test-topic-trainingset] Solr index directory 'C:\Dev\Stanbol\enhancement-engines\topic\engine\target\enginetest-files\test1\trainingsetserver\test-topic-trainingset\data\index' doesn't exist. Creating new index...
          10:27:08,336 INFO TopicClassificationEngine:1070 - Performing evaluation 3-fold CV iteration 1/3 on classifier test-engine
          10:27:08,383 WARN SolrConfig:148 - <indexDefaults> and <mainIndex> configuration sections are deprecated (but still work). Please use <indexConfig> instead.
          10:27:08,632 WARN SolrCore:395 - [default-topic-model] Solr index directory 'C:\Users\Esse\AppData\Local\Temp\stanbol-evaluation-folder-6798239234465224100.tmp\evaluationclassifierserver\default-topic-model\data\index' doesn't exist. Creating new index...
          10:27:09,958 DEBUG TopicClassificationEngine:974 - Sucessfully updated topic urn:t/001 in 0.062s
          10:27:09,974 DEBUG TopicClassificationEngine:974 - Sucessfully updated topic urn:t/002 in 0.016s
          10:27:09,990 DEBUG TopicClassificationEngine:974 - Sucessfully updated topic urn:t/003 in 0.016s
          10:27:10,005 DEBUG TopicClassificationEngine:974 - Sucessfully updated topic urn:t/004 in 0.015s
          10:27:10,036 DEBUG TopicClassificationEngine:974 - Sucessfully updated topic urn:t/005 in 0.031s
          10:27:10,052 DEBUG TopicClassificationEngine:974 - Sucessfully updated topic urn:t/006 in 0.016s
          10:27:10,067 DEBUG TopicClassificationEngine:974 - Sucessfully updated topic urn:t/007 in 0.015s
          10:27:10,083 DEBUG TopicClassificationEngine:974 - Sucessfully updated topic urn:t/008 in 0.016s
          10:27:10,098 DEBUG TopicClassificationEngine:974 - Sucessfully updated topic urn:t/009 in 0.015s
          10:27:10,130 DEBUG TopicClassificationEngine:974 - Sucessfully updated topic urn:t/010 in 0.032s
          10:27:10,208 INFO TopicClassificationEngine:894 - Sucessfully updated 10 topics in 0.312s
          10:27:10,660 INFO TopicClassificationEngine:1281 - Performance for concept 'urn:t/001': precision=0.461538, recall=1.000000, positiveSupport=6, negativeSupport=28
          10:27:10,863 INFO TopicClassificationEngine:1281 - Performance for concept 'urn:t/002': precision=1.000000, recall=0.500000, positiveSupport=6, negativeSupport=28
          10:27:11,035 INFO TopicClassificationEngine:1281 - Performance for concept 'urn:t/003': precision=0.714286, recall=1.000000, positiveSupport=5, negativeSupport=29
          10:27:11,206 INFO TopicClassificationEngine:1281 - Performance for concept 'urn:t/004': precision=0.500000, recall=0.666667, positiveSupport=6, negativeSupport=28
          10:27:11,362 INFO TopicClassificationEngine:1281 - Performance for concept 'urn:t/005': precision=1.000000, recall=1.000000, positiveSupport=7, negativeSupport=27
          10:27:11,565 INFO TopicClassificationEngine:1281 - Performance for concept 'urn:t/006': precision=1.000000, recall=0.500000, positiveSupport=4, negativeSupport=30
          10:27:11,706 INFO TopicClassificationEngine:1281 - Performance for concept 'urn:t/007': precision=0.714286, recall=0.833333, positiveSupport=6, negativeSupport=28
          10:27:11,861 INFO TopicClassificationEngine:1281 - Performance for concept 'urn:t/008': precision=1.000000, recall=0.777778, positiveSupport=9, negativeSupport=25
          10:27:11,986 INFO TopicClassificationEngine:1281 - Performance for concept 'urn:t/009': precision=1.000000, recall=1.000000, positiveSupport=7, negativeSupport=27
          10:27:12,127 INFO TopicClassificationEngine:1281 - Performance for concept 'urn:t/010': precision=0.875000, recall=0.875000, positiveSupport=8, negativeSupport=26
          10:27:12,345 INFO TopicClassificationEngine:1236 - Finished CV iteration 1/3 on classifier test-engine in 4.009000s.
          10:27:12,345 INFO TopicClassificationEngine:1070 - Performing evaluation 3-fold CV iteration 2/3 on classifier test-engine
          10:27:12,392 WARN SolrConfig:148 - <indexDefaults> and <mainIndex> configuration sections are deprecated (but still work). Please use <indexConfig> instead.
          10:27:12,626 ERROR SolrCore:161 - java.lang.NullPointerException
          at org.apache.solr.core.SolrCore.close(SolrCore.java:712)
          at org.apache.solr.core.SolrCore.<init>(SolrCore.java:599)
          at org.apache.solr.core.CoreContainer.create(CoreContainer.java:480)
          at org.apache.stanbol.enhancer.topic.EmbeddedSolrHelper.makeEmbeddedSolrServer(EmbeddedSolrHelper.java:84)
          at org.apache.stanbol.enhancer.engine.topic.TopicClassificationEngine.performCVFold(TopicClassificationEngine.java:1082)
          at org.apache.stanbol.enhancer.engine.topic.TopicClassificationEngine.updatePerformanceEstimates(TopicClassificationEngine.java:1043)
          at org.apache.stanbol.enhancer.engine.topic.TopicEngineTest.testCrossValidation(TopicEngineTest.java:483)
          at sun.reflect.NativeMethodAccessorImpl.invoke0(Native Method)
          at sun.reflect.NativeMethodAccessorImpl.invoke(NativeMethodAccessorImpl.java:39)
          at sun.reflect.DelegatingMethodAccessorImpl.invoke(DelegatingMethodAccessorImpl.java:25)
          at java.lang.reflect.Method.invoke(Method.java:597)
          at org.junit.runners.model.FrameworkMethod$1.runReflectiveCall(FrameworkMethod.java:47)
          at org.junit.internal.runners.model.ReflectiveCallable.run(ReflectiveCallable.java:12)
          at org.junit.runners.model.FrameworkMethod.invokeExplosively(FrameworkMethod.java:44)
          at org.junit.internal.runners.statements.InvokeMethod.evaluate(InvokeMethod.java:17)
          at org.junit.internal.runners.statements.RunBefores.evaluate(RunBefores.java:26)
          at org.junit.internal.runners.statements.RunAfters.evaluate(RunAfters.java:27)
          at org.junit.runners.ParentRunner.runLeaf(ParentRunner.java:271)
          at org.junit.runners.BlockJUnit4ClassRunner.runChild(BlockJUnit4ClassRunner.java:70)
          at org.junit.runners.BlockJUnit4ClassRunner.runChild(BlockJUnit4ClassRunner.java:50)
          at org.junit.runners.ParentRunner$3.run(ParentRunner.java:238)
          at org.junit.runners.ParentRunner$1.schedule(ParentRunner.java:63)
          at org.junit.runners.ParentRunner.runChildren(ParentRunner.java:236)
          at org.junit.runners.ParentRunner.access$000(ParentRunner.java:53)
          at org.junit.runners.ParentRunner$2.evaluate(ParentRunner.java:229)
          at org.junit.internal.runners.statements.RunBefores.evaluate(RunBefores.java:26)
          at org.junit.internal.runners.statements.RunAfters.evaluate(RunAfters.java:27)
          at org.junit.runners.ParentRunner.run(ParentRunner.java:309)
          at org.apache.maven.surefire.junit4.JUnit4Provider.execute(JUnit4Provider.java:234)
          at org.apache.maven.surefire.junit4.JUnit4Provider.executeTestSet(JUnit4Provider.java:133)
          at org.apache.maven.surefire.junit4.JUnit4Provider.invoke(JUnit4Provider.java:114)
          at sun.reflect.NativeMethodAccessorImpl.invoke0(Native Method)
          at sun.reflect.NativeMethodAccessorImpl.invoke(NativeMethodAccessorImpl.java:39)
          at sun.reflect.DelegatingMethodAccessorImpl.invoke(DelegatingMethodAccessorImpl.java:25)
          at java.lang.reflect.Method.invoke(Method.java:597)
          at org.apache.maven.surefire.util.ReflectionUtils.invokeMethodWithArray(ReflectionUtils.java:188)
          at org.apache.maven.surefire.booter.ProviderFactory$ProviderProxy.invoke(ProviderFactory.java:166)
          at org.apache.maven.surefire.booter.ProviderFactory.invokeProvider(ProviderFactory.java:86)
          at org.apache.maven.surefire.booter.ForkedBooter.runSuitesInProcess(ForkedBooter.java:101)
          at org.apache.maven.surefire.booter.ForkedBooter.main(ForkedBooter.java:74)

          Show
          Oak Ninja added a comment - Yes, it seems to be the same error as STANBOL-811 . See below for stacktrace. org.apache.stanbol.enhancer.topic.ClassifierException: org.apache.solr.common.SolrException at org.apache.stanbol.enhancer.engine.topic.TopicClassificationEngine.performCVFold(TopicClassificationEngine.java:1087) at org.apache.stanbol.enhancer.engine.topic.TopicClassificationEngine.updatePerformanceEstimates(TopicClassificationEngine.java:1043) at org.apache.stanbol.enhancer.engine.topic.TopicEngineTest.testCrossValidation(TopicEngineTest.java:483) at sun.reflect.NativeMethodAccessorImpl.invoke0(Native Method) at sun.reflect.NativeMethodAccessorImpl.invoke(NativeMethodAccessorImpl.java:39) at sun.reflect.DelegatingMethodAccessorImpl.invoke(DelegatingMethodAccessorImpl.java:25) at java.lang.reflect.Method.invoke(Method.java:597) at org.junit.runners.model.FrameworkMethod$1.runReflectiveCall(FrameworkMethod.java:47) at org.junit.internal.runners.model.ReflectiveCallable.run(ReflectiveCallable.java:12) at org.junit.runners.model.FrameworkMethod.invokeExplosively(FrameworkMethod.java:44) at org.junit.internal.runners.statements.InvokeMethod.evaluate(InvokeMethod.java:17) at org.junit.internal.runners.statements.RunBefores.evaluate(RunBefores.java:26) at org.junit.internal.runners.statements.RunAfters.evaluate(RunAfters.java:27) at org.junit.runners.ParentRunner.runLeaf(ParentRunner.java:271) at org.junit.runners.BlockJUnit4ClassRunner.runChild(BlockJUnit4ClassRunner.java:70) at org.junit.runners.BlockJUnit4ClassRunner.runChild(BlockJUnit4ClassRunner.java:50) at org.junit.runners.ParentRunner$3.run(ParentRunner.java:238) at org.junit.runners.ParentRunner$1.schedule(ParentRunner.java:63) at org.junit.runners.ParentRunner.runChildren(ParentRunner.java:236) at org.junit.runners.ParentRunner.access$000(ParentRunner.java:53) at org.junit.runners.ParentRunner$2.evaluate(ParentRunner.java:229) at org.junit.internal.runners.statements.RunBefores.evaluate(RunBefores.java:26) at org.junit.internal.runners.statements.RunAfters.evaluate(RunAfters.java:27) at org.junit.runners.ParentRunner.run(ParentRunner.java:309) at org.apache.maven.surefire.junit4.JUnit4Provider.execute(JUnit4Provider.java:234) at org.apache.maven.surefire.junit4.JUnit4Provider.executeTestSet(JUnit4Provider.java:133) at org.apache.maven.surefire.junit4.JUnit4Provider.invoke(JUnit4Provider.java:114) at sun.reflect.NativeMethodAccessorImpl.invoke0(Native Method) at sun.reflect.NativeMethodAccessorImpl.invoke(NativeMethodAccessorImpl.java:39) at sun.reflect.DelegatingMethodAccessorImpl.invoke(DelegatingMethodAccessorImpl.java:25) at java.lang.reflect.Method.invoke(Method.java:597) at org.apache.maven.surefire.util.ReflectionUtils.invokeMethodWithArray(ReflectionUtils.java:188) at org.apache.maven.surefire.booter.ProviderFactory$ProviderProxy.invoke(ProviderFactory.java:166) at org.apache.maven.surefire.booter.ProviderFactory.invokeProvider(ProviderFactory.java:86) at org.apache.maven.surefire.booter.ForkedBooter.runSuitesInProcess(ForkedBooter.java:101) at org.apache.maven.surefire.booter.ForkedBooter.main(ForkedBooter.java:74) Caused by: org.apache.solr.common.SolrException at org.apache.solr.core.SolrCore.<init>(SolrCore.java:600) at org.apache.solr.core.CoreContainer.create(CoreContainer.java:480) at org.apache.stanbol.enhancer.topic.EmbeddedSolrHelper.makeEmbeddedSolrServer(EmbeddedSolrHelper.java:84) at org.apache.stanbol.enhancer.engine.topic.TopicClassificationEngine.performCVFold(TopicClassificationEngine.java:1082) ... 35 more Caused by: java.lang.RuntimeException: org.apache.lucene.index.IndexNotFoundException: no segments* file found in org.apache.lucene.store.SimpleFSDirectory@C:\Users\Esse\AppData\Local\Temp\stanbol-evaluation-folder-6798239234465224100.tmp\evaluationclassifierserver\default-topic-model\data\index lockFactory=org.apache.lucene.store.NativeFSLockFactory@ac8360: files: [_b.fdt, _b.fdx, _b.frq, _b.prx, _b.tis, _b.tvd, _b.tvf, _b.tvx] at org.apache.solr.core.SolrCore.getSearcher(SolrCore.java:1104) at org.apache.solr.core.SolrCore.<init>(SolrCore.java:585) ... 38 more Caused by: org.apache.lucene.index.IndexNotFoundException: no segments* file found in org.apache.lucene.store.SimpleFSDirectory@C:\Users\Esse\AppData\Local\Temp\stanbol-evaluation-folder-6798239234465224100.tmp\evaluationclassifierserver\default-topic-model\data\index lockFactory=org.apache.lucene.store.NativeFSLockFactory@ac8360: files: [_b.fdt, _b.fdx, _b.frq, _b.prx, _b.tis, _b.tvd, _b.tvf, _b.tvx] at org.apache.lucene.index.SegmentInfos$FindSegmentsFile.run(SegmentInfos.java:667) at org.apache.lucene.index.DirectoryReader.open(DirectoryReader.java:72) at org.apache.lucene.index.IndexReader.open(IndexReader.java:375) at org.apache.solr.core.StandardIndexReaderFactory.newReader(StandardIndexReaderFactory.java:38) at org.apache.solr.core.SolrCore.getSearcher(SolrCore.java:1093) ... 39 more </error> <system-out>10:26:53,219 INFO TopicEngineTest:101 - Topic Enigne Test Folder : C:\Dev\Stanbol\enhancement-engines\topic\engine\target\enginetest-files 10:26:53,688 WARN SolrConfig:148 - <indexDefaults> and <mainIndex> configuration sections are deprecated (but still work). Please use <indexConfig> instead. 10:26:54,295 WARN SolrCore:395 - [test-topic-model] Solr index directory 'C:\Dev\Stanbol\enhancement-engines\topic\engine\target\enginetest-files\test1\classifierserver\test-topic-model\data\index' doesn't exist. Creating new index... 10:26:55,107 WARN SolrConfig:148 - <indexDefaults> and <mainIndex> configuration sections are deprecated (but still work). Please use <indexConfig> instead. 10:26:55,387 WARN SolrCore:395 - [test-topic-trainingset] Solr index directory 'C:\Dev\Stanbol\enhancement-engines\topic\engine\target\enginetest-files\test1\trainingsetserver\test-topic-trainingset\data\index' doesn't exist. Creating new index... 10:27:08,336 INFO TopicClassificationEngine:1070 - Performing evaluation 3-fold CV iteration 1/3 on classifier test-engine 10:27:08,383 WARN SolrConfig:148 - <indexDefaults> and <mainIndex> configuration sections are deprecated (but still work). Please use <indexConfig> instead. 10:27:08,632 WARN SolrCore:395 - [default-topic-model] Solr index directory 'C:\Users\Esse\AppData\Local\Temp\stanbol-evaluation-folder-6798239234465224100.tmp\evaluationclassifierserver\default-topic-model\data\index' doesn't exist. Creating new index... 10:27:09,958 DEBUG TopicClassificationEngine:974 - Sucessfully updated topic urn:t/001 in 0.062s 10:27:09,974 DEBUG TopicClassificationEngine:974 - Sucessfully updated topic urn:t/002 in 0.016s 10:27:09,990 DEBUG TopicClassificationEngine:974 - Sucessfully updated topic urn:t/003 in 0.016s 10:27:10,005 DEBUG TopicClassificationEngine:974 - Sucessfully updated topic urn:t/004 in 0.015s 10:27:10,036 DEBUG TopicClassificationEngine:974 - Sucessfully updated topic urn:t/005 in 0.031s 10:27:10,052 DEBUG TopicClassificationEngine:974 - Sucessfully updated topic urn:t/006 in 0.016s 10:27:10,067 DEBUG TopicClassificationEngine:974 - Sucessfully updated topic urn:t/007 in 0.015s 10:27:10,083 DEBUG TopicClassificationEngine:974 - Sucessfully updated topic urn:t/008 in 0.016s 10:27:10,098 DEBUG TopicClassificationEngine:974 - Sucessfully updated topic urn:t/009 in 0.015s 10:27:10,130 DEBUG TopicClassificationEngine:974 - Sucessfully updated topic urn:t/010 in 0.032s 10:27:10,208 INFO TopicClassificationEngine:894 - Sucessfully updated 10 topics in 0.312s 10:27:10,660 INFO TopicClassificationEngine:1281 - Performance for concept 'urn:t/001': precision=0.461538, recall=1.000000, positiveSupport=6, negativeSupport=28 10:27:10,863 INFO TopicClassificationEngine:1281 - Performance for concept 'urn:t/002': precision=1.000000, recall=0.500000, positiveSupport=6, negativeSupport=28 10:27:11,035 INFO TopicClassificationEngine:1281 - Performance for concept 'urn:t/003': precision=0.714286, recall=1.000000, positiveSupport=5, negativeSupport=29 10:27:11,206 INFO TopicClassificationEngine:1281 - Performance for concept 'urn:t/004': precision=0.500000, recall=0.666667, positiveSupport=6, negativeSupport=28 10:27:11,362 INFO TopicClassificationEngine:1281 - Performance for concept 'urn:t/005': precision=1.000000, recall=1.000000, positiveSupport=7, negativeSupport=27 10:27:11,565 INFO TopicClassificationEngine:1281 - Performance for concept 'urn:t/006': precision=1.000000, recall=0.500000, positiveSupport=4, negativeSupport=30 10:27:11,706 INFO TopicClassificationEngine:1281 - Performance for concept 'urn:t/007': precision=0.714286, recall=0.833333, positiveSupport=6, negativeSupport=28 10:27:11,861 INFO TopicClassificationEngine:1281 - Performance for concept 'urn:t/008': precision=1.000000, recall=0.777778, positiveSupport=9, negativeSupport=25 10:27:11,986 INFO TopicClassificationEngine:1281 - Performance for concept 'urn:t/009': precision=1.000000, recall=1.000000, positiveSupport=7, negativeSupport=27 10:27:12,127 INFO TopicClassificationEngine:1281 - Performance for concept 'urn:t/010': precision=0.875000, recall=0.875000, positiveSupport=8, negativeSupport=26 10:27:12,345 INFO TopicClassificationEngine:1236 - Finished CV iteration 1/3 on classifier test-engine in 4.009000s. 10:27:12,345 INFO TopicClassificationEngine:1070 - Performing evaluation 3-fold CV iteration 2/3 on classifier test-engine 10:27:12,392 WARN SolrConfig:148 - <indexDefaults> and <mainIndex> configuration sections are deprecated (but still work). Please use <indexConfig> instead. 10:27:12,626 ERROR SolrCore:161 - java.lang.NullPointerException at org.apache.solr.core.SolrCore.close(SolrCore.java:712) at org.apache.solr.core.SolrCore.<init>(SolrCore.java:599) at org.apache.solr.core.CoreContainer.create(CoreContainer.java:480) at org.apache.stanbol.enhancer.topic.EmbeddedSolrHelper.makeEmbeddedSolrServer(EmbeddedSolrHelper.java:84) at org.apache.stanbol.enhancer.engine.topic.TopicClassificationEngine.performCVFold(TopicClassificationEngine.java:1082) at org.apache.stanbol.enhancer.engine.topic.TopicClassificationEngine.updatePerformanceEstimates(TopicClassificationEngine.java:1043) at org.apache.stanbol.enhancer.engine.topic.TopicEngineTest.testCrossValidation(TopicEngineTest.java:483) at sun.reflect.NativeMethodAccessorImpl.invoke0(Native Method) at sun.reflect.NativeMethodAccessorImpl.invoke(NativeMethodAccessorImpl.java:39) at sun.reflect.DelegatingMethodAccessorImpl.invoke(DelegatingMethodAccessorImpl.java:25) at java.lang.reflect.Method.invoke(Method.java:597) at org.junit.runners.model.FrameworkMethod$1.runReflectiveCall(FrameworkMethod.java:47) at org.junit.internal.runners.model.ReflectiveCallable.run(ReflectiveCallable.java:12) at org.junit.runners.model.FrameworkMethod.invokeExplosively(FrameworkMethod.java:44) at org.junit.internal.runners.statements.InvokeMethod.evaluate(InvokeMethod.java:17) at org.junit.internal.runners.statements.RunBefores.evaluate(RunBefores.java:26) at org.junit.internal.runners.statements.RunAfters.evaluate(RunAfters.java:27) at org.junit.runners.ParentRunner.runLeaf(ParentRunner.java:271) at org.junit.runners.BlockJUnit4ClassRunner.runChild(BlockJUnit4ClassRunner.java:70) at org.junit.runners.BlockJUnit4ClassRunner.runChild(BlockJUnit4ClassRunner.java:50) at org.junit.runners.ParentRunner$3.run(ParentRunner.java:238) at org.junit.runners.ParentRunner$1.schedule(ParentRunner.java:63) at org.junit.runners.ParentRunner.runChildren(ParentRunner.java:236) at org.junit.runners.ParentRunner.access$000(ParentRunner.java:53) at org.junit.runners.ParentRunner$2.evaluate(ParentRunner.java:229) at org.junit.internal.runners.statements.RunBefores.evaluate(RunBefores.java:26) at org.junit.internal.runners.statements.RunAfters.evaluate(RunAfters.java:27) at org.junit.runners.ParentRunner.run(ParentRunner.java:309) at org.apache.maven.surefire.junit4.JUnit4Provider.execute(JUnit4Provider.java:234) at org.apache.maven.surefire.junit4.JUnit4Provider.executeTestSet(JUnit4Provider.java:133) at org.apache.maven.surefire.junit4.JUnit4Provider.invoke(JUnit4Provider.java:114) at sun.reflect.NativeMethodAccessorImpl.invoke0(Native Method) at sun.reflect.NativeMethodAccessorImpl.invoke(NativeMethodAccessorImpl.java:39) at sun.reflect.DelegatingMethodAccessorImpl.invoke(DelegatingMethodAccessorImpl.java:25) at java.lang.reflect.Method.invoke(Method.java:597) at org.apache.maven.surefire.util.ReflectionUtils.invokeMethodWithArray(ReflectionUtils.java:188) at org.apache.maven.surefire.booter.ProviderFactory$ProviderProxy.invoke(ProviderFactory.java:166) at org.apache.maven.surefire.booter.ProviderFactory.invokeProvider(ProviderFactory.java:86) at org.apache.maven.surefire.booter.ForkedBooter.runSuitesInProcess(ForkedBooter.java:101) at org.apache.maven.surefire.booter.ForkedBooter.main(ForkedBooter.java:74)
          Hide
          Oak Ninja added a comment -

          Compiling without running tests gives me a different error:

          [INFO] BUILD FAILURE
          [INFO] ------------------------------------------------------------------------
          [INFO] Total time: 6:29.910s
          [INFO] Finished at: Mon Feb 25 10:57:03 CET 2013
          [INFO] Final Memory: 258M/616M
          [INFO] ------------------------------------------------------------------------
          [ERROR] Failed to execute goal on project org.apache.stanbol.launchers.bundlelists.languageextras.smartcn: Could not res
          olve dependencies for project org.apache.stanbol:org.apache.stanbol.launchers.bundlelists.languageextras.smartcn:partial
          bundlelist:0.10.0-SNAPSHOT: The following artifacts could not be resolved: org.apache.stanbol:org.apache.stanbol.enhance
          r.engines.smartcn.token:jar:0.10.0-SNAPSHOT, org.apache.stanbol:org.apache.stanbol.enhancer.engines.entitylinking.labelt
          okenizer.smartcn:jar:0.10.0-SNAPSHOT: Could not find artifact org.apache.stanbol:org.apache.stanbol.enhancer.engines.sma
          rtcn.token:jar:0.10.0-SNAPSHOT in apache.snapshots (http://repository.apache.org/snapshots) -> [Help 1]
          [ERROR]
          [ERROR] To see the full stack trace of the errors, re-run Maven with the -e switch.
          [ERROR] Re-run Maven using the -X switch to enable full debug logging.
          [ERROR]
          [ERROR] For more information about the errors and possible solutions, please read the following articles:
          [ERROR] [Help 1] http://cwiki.apache.org/confluence/display/MAVEN/DependencyResolutionException
          [ERROR]
          [ERROR] After correcting the problems, you can resume the build with the command
          [ERROR] mvn <goals> -rf :org.apache.stanbol.launchers.bundlelists.languageextras.smartcn

          Show
          Oak Ninja added a comment - Compiling without running tests gives me a different error: [INFO] BUILD FAILURE [INFO] ------------------------------------------------------------------------ [INFO] Total time: 6:29.910s [INFO] Finished at: Mon Feb 25 10:57:03 CET 2013 [INFO] Final Memory: 258M/616M [INFO] ------------------------------------------------------------------------ [ERROR] Failed to execute goal on project org.apache.stanbol.launchers.bundlelists.languageextras.smartcn: Could not res olve dependencies for project org.apache.stanbol:org.apache.stanbol.launchers.bundlelists.languageextras.smartcn:partial bundlelist:0.10.0-SNAPSHOT: The following artifacts could not be resolved: org.apache.stanbol:org.apache.stanbol.enhance r.engines.smartcn.token:jar:0.10.0-SNAPSHOT, org.apache.stanbol:org.apache.stanbol.enhancer.engines.entitylinking.labelt okenizer.smartcn:jar:0.10.0-SNAPSHOT: Could not find artifact org.apache.stanbol:org.apache.stanbol.enhancer.engines.sma rtcn.token:jar:0.10.0-SNAPSHOT in apache.snapshots ( http://repository.apache.org/snapshots ) -> [Help 1] [ERROR] [ERROR] To see the full stack trace of the errors, re-run Maven with the -e switch. [ERROR] Re-run Maven using the -X switch to enable full debug logging. [ERROR] [ERROR] For more information about the errors and possible solutions, please read the following articles: [ERROR] [Help 1] http://cwiki.apache.org/confluence/display/MAVEN/DependencyResolutionException [ERROR] [ERROR] After correcting the problems, you can resume the build with the command [ERROR] mvn <goals> -rf :org.apache.stanbol.launchers.bundlelists.languageextras.smartcn
          Hide
          Rupert Westenthaler added a comment -

          Sorry forgot to commit two file last night. With revision 1449638 the above error should be gone.

          Can you also try to build with tests enabled. With revision 1449609 I applied a change to the topic engine unit tests that should hopefully fix the unit test problem.

          best
          Rupert

          Show
          Rupert Westenthaler added a comment - Sorry forgot to commit two file last night. With revision 1449638 the above error should be gone. Can you also try to build with tests enabled. With revision 1449609 I applied a change to the topic engine unit tests that should hopefully fix the unit test problem. best Rupert
          Hide
          Oak Ninja added a comment -

          Hi!

          I tried building again and got a whole lot further - latest failure stacktrace below:

          [INFO] ------------------------------------------------------------------------
          [INFO] Reactor Summary:
          [INFO]
          [INFO] Apache Stanbol Releasing Source Assembly Descriptor SUCCESS [2.793s]
          [INFO] Apache Stanbol Parent ............................. SUCCESS [0.624s]
          [INFO] Apache Stanbol Data Parent ........................ SUCCESS [2.933s]
          [INFO] Apache Stanbol Data Default Configuration ......... SUCCESS [1.326s]
          [INFO] Apache Stanbol Data: DBpedia.org .................. SUCCESS [4.539s]
          [INFO] Apache Stanbol Data: Remote DBpedia.org with local cache SUCCESS [0.344s]
          [INFO] Apache Stanbol Data: Default ontology registries .. SUCCESS [0.234s]
          [INFO] Apache Stanbol Data: OpenNLP Models for Danish .... SUCCESS [0.811s]
          [INFO] Apache Stanbol Data: OpenNLP Models for German .... SUCCESS [1.263s]
          [INFO] Apache Stanbol Data: OpenNLP Models for English ... SUCCESS [1.517s]
          [INFO] Apache Stanbol Data: OpenNLP Models for Spanish ... SUCCESS [5.659s]
          [INFO] Apache Stanbol Data: OpenNLP Models for Dutch ..... SUCCESS [0.828s]
          [INFO] Apache Stanbol Data: OpenNLP Models for Portuguese SUCCESS [0.936s]
          [INFO] Apache Stanbol Data: OpenNLP Models for Swedish ... SUCCESS [0.670s]
          [INFO] Apache Stanbol Data: OpenNLP NER Models for English SUCCESS [1.295s]
          [INFO] Apache Stanbol Data: OpenNLP NER Models for Spanish SUCCESS [1.170s]
          [INFO] Apache Stanbol Data: OpenNLP NER Models for Dutch . SUCCESS [1.154s]
          [INFO] Apache Stanbol Data: SentimentWortschatz Models for German SUCCESS [0.921s]
          [INFO] Apache Stanbol Data: SentiWordNet Models for English SUCCESS [0.999s]
          [INFO] Apache Stanbol Data ............................... SUCCESS [0.265s]
          [INFO] Apache Stanbol Commons Framework Fragment ......... SUCCESS [4.680s]
          [INFO] Apache Stanbol Commons Web Base ................... SUCCESS [5.148s]
          [INFO] Apache Stanbol Commons Web Base Jersey ............ SUCCESS [1.825s]
          [INFO] Apache Stanbol Commons Web Home Page .............. SUCCESS [2.901s]
          [INFO] Apache Stanbol Commons Web Viewable ............... SUCCESS [0.890s]
          [INFO] Apache Stanbol Commons LDPath Template Rendering .. SUCCESS [1.638s]
          [INFO] Apache Stanbol Commons Web Message Body Writers for RDFViewable SUCCESS [1.295s]
          [INFO] Apache Stanbol Commons Web Template Viewable Writer SUCCESS [1.045s]
          [INFO] Apache Stanbol Commons Web Resources .............. SUCCESS [0.717s]
          [INFO] Apache Stanbol Commons Web SPARQL ................. SUCCESS [1.358s]
          [INFO] Apache Stanbol Commons Freemarker Utilities ....... SUCCESS [1.014s]
          [INFO] Apache Stanbol Commons HTTP Query Headers ......... SUCCESS [0.671s]
          [INFO] Apache Stanbol Commons Data File Provider ......... SUCCESS [1.404s]
          [INFO] Apache Stanbol Commons Data File Provider for Bundles SUCCESS [0.826s]
          [INFO] Apache Stanbol Commons Offline Utilities .......... SUCCESS [1.014s]
          [INFO] Apache Stanbol Commons Installer Bundle Provider .. SUCCESS [0.796s]
          [INFO] Apache Stanbol Commons Namespace Prefix Service ... SUCCESS [1.076s]
          [INFO] Apache Stanbol Commons Namespace Prefix Provider for Stanbol Default Mappings SUCCESS [1.404s]
          [INFO] Apache Stanbol Commons prefix.cc based Namespace Prefix Provider SUCCESS [1.014s]
          [INFO] Apache Stanbol Commons Solr Core .................. SUCCESS [5.102s]
          [INFO] Apache Stanbol Commons Solr Managed ............... SUCCESS [2.356s]
          [INFO] Apache Stanbol Commons Solr Web ................... SUCCESS [2.340s]
          [INFO] Apache Stanbol Commons Solr Installer ............. SUCCESS [1.356s]
          [INFO] Apache Stanbol Commons Solr Defauts ............... SUCCESS [0.219s]
          [INFO] Apache Stanbol Commons Solr Extras: Lucene Smartcn Bundle SUCCESS [0.265s]
          [INFO] Apache Stanbol Commons Solr Extension for Paoding Analysis SUCCESS [2.745s]
          [INFO] Apache Stanbol Commons Solr Extras: Lucene Stempel Bundle SUCCESS [0.141s]
          [INFO] Apache Stanbol Commons Jobs API ................... SUCCESS [1.264s]
          [INFO] Apache Stanbol Commons Jobs Web ................... SUCCESS [1.061s]
          [INFO] Apache Stanbol Commons Jobs Reactor ............... SUCCESS [0.031s]
          [INFO] Apache Stanbol Commons OpenNLP Utilities and Models SUCCESS [1.965s]
          [INFO] Apache Stanbol Commons OWL Bundle ................. SUCCESS [3.885s]
          [INFO] Apache Stanbol Commons Indexed Clerezza inMemory graph implementation SUCCESS [1.544s]
          [INFO] Apache Stanbol Commons JSON-LD API ................ SUCCESS [0.811s]
          [INFO] Apache Stanbol Commons Clerezza LDPath Repository . SUCCESS [0.952s]
          [INFO] Apache Stanbol Commons Launchpad .................. SUCCESS [1.341s]
          [INFO] Apache Stanbol Commons Security Core .............. SUCCESS [1.701s]
          [INFO] Apache Stanbol Commons Basic Authenticator ........ SUCCESS [1.498s]
          [INFO] Apache Stanbol Commons Felix Webconsole Security Provider SUCCESS [0.624s]
          [INFO] Apache Stanbol Commons User Management ............ SUCCESS [2.668s]
          [INFO] Apache Stanbol Commons CAS Light .................. SUCCESS [1.107s]
          [INFO] Apache Stanbol Commons Testing Jar Executor ....... SUCCESS [1.623s]
          [INFO] Apache Stanbol Commons Testing HTTP Testing Library SUCCESS [1.388s]
          [INFO] Apache Stanbol Commons Testing Stanbol Utilities .. SUCCESS [1.654s]
          [INFO] Apache Stanbol Commons ............................ SUCCESS [0.077s]
          [INFO] Apache Stanbol Entityhub .......................... SUCCESS [0.047s]
          [INFO] Apache Stanbol Entityhub Generic Service API ...... SUCCESS [1.670s]
          [INFO] Apache Stanbol Entityhub Generic Test Framework ... SUCCESS [2.230s]
          [INFO] Apache Stanbol Entityhub Generic Core ............. SUCCESS [3.307s]
          [INFO] Apache Stanbol Entityhub Model Clerezza ........... SUCCESS [2.262s]
          [INFO] Apache Stanbol Entityhub Query SPARQL ............. SUCCESS [1.919s]
          [INFO] Apache Stanbol Entityhub Site Linked Data Protocol SUCCESS [1.950s]
          [INFO] Apache Stanbol Entityhub Managed Site ............. SUCCESS [0.827s]
          [INFO] Apache Stanbol Entityhub Yard based on Clerezza ... SUCCESS [1.825s]
          [INFO] Apache Stanbol Entityhub Yard based on Solr ....... SUCCESS [2.653s]
          [INFO] Apache Stanbol Entityhub Web Jersey HTTP Endpoint . SUCCESS [4.165s]
          [INFO] Apache Stanbol Entityhub LDPath Support ........... SUCCESS [1.840s]
          [INFO] Apache Stanbol Entityhub Indexing ................. SUCCESS [0.078s]
          [INFO] Apache Stanbol Entityhub Indexing Core ............ SUCCESS [2.699s]
          [INFO] Apache Stanbol Entityhub Indexing Source for Jena TDB SUCCESS [3.542s]
          [INFO] Apache Stanbol Entityhub Indexing Source for vCard SUCCESS [1.466s]
          [INFO] Apache Stanbol Entityhub Indexing Destination SolrYard SUCCESS [3.198s]
          [INFO] Apache Stanbol Entityhub Indexing Generic RDF ..... SUCCESS [1.794s]
          [INFO] Apache Stanbol Entityhub Indexing for geonames.org SUCCESS [1.825s]
          [INFO] Apache Stanbol Entityhub Indexing for DBpedia.org . SUCCESS [1.170s]
          [INFO] Apache Stanbol Entityhub Indexing for dblp ........ SUCCESS [0.780s]
          [INFO] Apache Stanbol Entityhub Default Configuration .... SUCCESS [0.126s]
          [INFO] Apache Stanbol Ontology Manager : Services API .... SUCCESS [4.523s]
          [INFO] Apache Stanbol Ontology Manager : Input Sources (Clerezza-based) SUCCESS [1.669s]
          [INFO] Apache Stanbol Ontology Manager : Input Sources (OWL API-based) SUCCESS [1.904s]
          [INFO] Apache Stanbol Ontology Manager : Core ............ SUCCESS [2.511s]
          [INFO] Apache Stanbol Ontology Manager : Network Multiplexer (Clerezza implementation) SUCCESS [3.105s]
          [INFO] Apache Stanbol Ontology Manager : Registry Manager SUCCESS [4.071s]
          [INFO] Apache Stanbol Ontology Manager : Web ............. SUCCESS [3.744s]
          [INFO] Apache Stanbol Ontology Manager Reactor ........... SUCCESS [0.125s]
          [INFO] Apache Stanbol Rules Services API ................. SUCCESS [2.637s]
          [INFO] Apache Stanbol Rules Manager ...................... SUCCESS [4.539s]
          [INFO] Apache Stanbol Rules Abstract Adapter ............. SUCCESS [1.498s]
          [INFO] Apache Stanbol Rules Jena Adapter ................. SUCCESS [3.713s]
          [INFO] Apache Stanbol Rules SPARQL Adapter ............... SUCCESS [2.496s]
          [INFO] Apache Stanbol Rules Clerezza Adapter ............. SUCCESS [4.368s]
          [INFO] Apache Stanbol Rules SWRL Adapter ................. SUCCESS [2.636s]
          [INFO] Apache Stanbol Rules Adapter Reactor .............. SUCCESS [0.062s]
          [INFO] Apache Stanbol Rules Refactorer ................... SUCCESS [2.995s]
          [INFO] Apache Stanbol Rules Web .......................... SUCCESS [3.184s]
          [INFO] Apache Stanbol Rules Reactor ...................... SUCCESS [0.046s]
          [INFO] Apache Stanbol Enhancer ........................... SUCCESS [0.047s]
          [INFO] Apache Stanbol Enhancer Services API .............. SUCCESS [4.041s]
          [INFO] Apache Stanbol Enhancer Core ...................... SUCCESS [2.247s]
          [INFO] Apache Stanbol Enhancer Test framework ............ SUCCESS [1.403s]
          [INFO] Apache Stanbol Enhancer RDF entities .............. SUCCESS [2.480s]
          [INFO] Apache Stanbol Enhancer NLP ....................... SUCCESS [2.995s]
          [INFO] Apache Stanbol Enhancer NLP JSON serialization support SUCCESS [3.198s]
          [INFO] Apache Stanbol Enhancer Weighted Job Manager ...... SUCCESS [1.092s]
          [INFO] Apache Stanbol Enhancer Event Jobmanager .......... SUCCESS [2.606s]
          [INFO] Apache Stanbol Enhancer JobManager Reactor ........ SUCCESS [0.062s]
          [INFO] Apache Stanbol Enhancer Chain: DefaultChain ....... SUCCESS [0.937s]
          [INFO] Apache Stanbol Enhancer Chain: GraphChain ......... SUCCESS [1.044s]
          [INFO] Apache Stanbol Enhancer Chain: Weighted ........... SUCCESS [2.044s]
          [INFO] Apache Stanbol Enhancer Chain: List ............... SUCCESS [0.889s]
          [INFO] Apache Stanbol Enhancer Web (Jersey) .............. SUCCESS [5.601s]
          [INFO] Apache Stanbol Enhancer LDPath .................... SUCCESS [1.388s]
          [INFO] Apache Stanbol Enhancer Benchmark ................. SUCCESS [2.948s]
          [INFO] Apache Stanbol Enhancer Defaults Configuration .... SUCCESS [0.156s]
          [INFO] Apache Stanbol Contenthub ......................... SUCCESS [0.032s]
          [INFO] Apache Stanbol Contenthub Service API ............. SUCCESS [1.435s]
          [INFO] Apache Stanbol Contenthub Solr Store .............. SUCCESS [3.478s]
          [INFO] Apache Stanbol Contenthub Clerezza Store .......... SUCCESS [4.822s]
          [INFO] Apache Stanbol Contenthub InMemory Store .......... SUCCESS [1.060s]
          [INFO] Apache Stanbol Contenthub Store Reactor ........... SUCCESS [0.046s]
          [INFO] Apache Stanbol Contenthub Search Solr Searcher .... SUCCESS [3.058s]
          [INFO] Apache Stanbol Contenthub Search Related Keyword Searcher SUCCESS [1.873s]
          [INFO] Apache Stanbol Contenthub Featured Search ......... SUCCESS [3.384s]
          [INFO] Apache Stanbol Contenthub Search Reactor .......... SUCCESS [0.094s]
          [INFO] Apache Stanbol Contenthub Web ..................... SUCCESS [3.728s]
          [INFO] Apache Stanbol Contenthub Clerezza LDPath Backend . SUCCESS [3.542s]
          [INFO] Apache Stanbol Enhancement Engines ................ SUCCESS [0.062s]
          [INFO] Apache Stanbol Enhancement Engine : Tika .......... SUCCESS [3.370s]
          [INFO] Apache Stanbol Enhancement Engine : HTML Extractor SUCCESS [1.606s]
          [INFO] Apache Stanbol Enhancement Engine : XMP Extractor . SUCCESS [3.262s]
          [INFO] Apache Stanbol Enhancement Engine : Metaxa ........ SUCCESS [4.368s]
          [INFO] Apache Stanbol Enhancement Engine : Refactor Engine SUCCESS [3.899s]
          [INFO] Apache Stanbol Enhancement Engine : Language Detection SUCCESS [1.014s]
          [INFO] Apache Stanbol Enhancement Engine : Language Identifier SUCCESS [2.746s]
          [INFO] Apache Stanbol Enhancement Engine : OpenNLP ....... SUCCESS [0.062s]
          [INFO] Apache Stanbol Enhancement Engine : OpenNLP Sentence Detection SUCCESS [1.092s]
          [INFO] Apache Stanbol Enhancement Engine : OpenNLP Tokenizer SUCCESS [0.952s]
          [INFO] Apache Stanbol Enhancement Engine : OpenNLP POS Tagging SUCCESS [2.855s]
          [INFO] Apache Stanbol Enhancement Engine : OpenNLP NER ... SUCCESS [1.294s]
          [INFO] Apache Stanbol Enhancement Engine : OpenNLP Chunker SUCCESS [3.011s]
          [INFO] Apache Stanbol Enhancement Engine : Smart Chinese Tokenizer SUCCESS [1.093s]
          [INFO] Apache Stanbol Enhancement Engine : Paoding Chinese Tokenizer SUCCESS [2.682s]
          [INFO] Apache Stanbol Enhancement Engine : NLP to RDF converter SUCCESS [0.937s]
          [INFO] Apache Stanbol Enhancement Engine : RESTful NLP processing SUCCESS [1.311s]
          [INFO] Apache Stanbol Enhancement Engine : RESTful Language Identification SUCCESS [2.822s]
          [INFO] Apache Stanbol Enhancement Engine : Entity Linking SUCCESS [0.031s]
          [INFO] Apache Stanbol Enhancement Engine : Entity Linking Engine SUCCESS [2.169s]
          [INFO] Apache Stanbol Enhancement Engine : Entity Linking LabelTokenizer : Lucene SUCCESS [3.167s]
          [INFO] Apache Stanbol Enhancement Engine : Entity Linking LabelTokenizer : OpenNLP SUCCESS [1.061s]
          [INFO] Apache Stanbol Enhancement Engine : Entity Linking LabelTokenizer : Smart Chinese SUCCESS [0.624s]
          [INFO] Apache Stanbol Enhancement Engine : Entity Linking LabelTokenizer : Paoding SUCCESS [2.980s]
          [INFO] Apache Stanbol Enhancement Engine : Entityhub Linking SUCCESS [1.388s]
          [INFO] Apache Stanbol Enhancement Engine : Entity Tagging SUCCESS [1.591s]
          [INFO] Apache Stanbol Enhancement Engine : Keyword Extraction SUCCESS [3.650s]
          [INFO] Apache Stanbol Enhancement Engine : Topic Classification SUCCESS [4.369s]
          [INFO] Apache Stanbol Enhancement Engine : Topic Classification : Web API SUCCESS [3.619s]
          [INFO] Apache Stanbol Enhancement Engine : Sentiment Word Classifier SUCCESS [1.935s]
          [INFO] Apache Stanbol Enhancement Engine : Sentiment Summarization SUCCESS [2.901s]
          [INFO] Apache Stanbol Enhancer Enhancement Engine : Disambiguation using Solr MLT SUCCESS [1.295s]
          [INFO] Apache Stanbol Enhancement Engine : UIMA .......... SUCCESS [0.047s]
          [INFO] Apache Stanbol Enhancement Engine : UIMA Remote Client SUCCESS [3.697s]
          [INFO] Apache Stanbol Enhancement Engine : UIMA To Triples SUCCESS [1.014s]
          [INFO] Apache Stanbol Enhancement Engine : UIMA Local Client SUCCESS [1.950s]
          [INFO] Apache Stanbol Enhancement Engine : CELI Engine ... SUCCESS [4.212s]
          [INFO] Apache Stanbol Enhancement Engine : DBPedia Spotlight SUCCESS [1.498s]
          [INFO] Apache Stanbol Enhancement Engine : Geonames Linking SUCCESS [3.260s]
          [INFO] Apache Stanbol Enhancement Engine : OpenCalais .... SUCCESS [1.279s]
          [INFO] Apache Stanbol Enhancement Engine : Zemanta ....... SUCCESS [2.996s]
          [INFO] Apache Stanbol CMS Adapter Parent ................. SUCCESS [0.062s]
          [INFO] Apache Stanbol CMS Adapter Service API ............ SUCCESS [2.480s]
          [INFO] Apache Stanbol CMS Adapter Core ................... SUCCESS [5.242s]
          [INFO] Apache Stanbol CMS Adapter JCR .................... SUCCESS [2.246s]
          [INFO] Apache Stanbol CMS Adapter CMIS Bundle ............ SUCCESS [2.746s]
          [INFO] Apache Stanbol CMS Adapter Web .................... SUCCESS [3.994s]
          [INFO] Apache Stanbol CMS Adapter Reactor ................ SUCCESS [0.046s]
          [INFO] Apache Stanbol Reasoners Services API ............. SUCCESS [0.749s]
          [INFO] Apache Stanbol Reasoners Service Manager .......... SUCCESS [2.574s]
          [INFO] Apache Stanbol Reasoners OWL API .................. SUCCESS [1.436s]
          [INFO] Apache Stanbol Reasoners Jena ..................... SUCCESS [2.933s]
          [INFO] Apache Stanbol Reasoners Test Framework ........... SUCCESS [1.122s]
          [INFO] Apache Stanbol Reasoners Web ...................... SUCCESS [3.682s]
          [INFO] Apache Stanbol Reasoners Reactor .................. SUCCESS [0.047s]
          [INFO] Apache Stanbol Demos Enhancer VIE UI .............. SUCCESS [5.163s]
          [INFO] Apache Stanbol Bundlelists ........................ SUCCESS [0.047s]
          [INFO] Apache Stanbol Bundlelist for the OSGi Framework .. SUCCESS [0.827s]
          [INFO] Apache Stanbol Bundlelist for Commons Libraries ... SUCCESS [2.636s]
          [INFO] Apache Stanbol Bundlelist for Default Data ........ SUCCESS [0.187s]
          [INFO] Apache Stanbol Bundlelist for OpenNLP Models ...... SUCCESS [0.266s]
          [INFO] Apache Stanbol Bundlelist for Sentiment Data ...... SUCCESS [0.156s]
          [INFO] Apache Stanbol Bundlelist for Enhancer ............ SUCCESS [1.717s]
          [INFO] Apache Stanbol Bundlelist for Entityhub ........... SUCCESS [0.468s]
          [INFO] Apache Stanbol Bundlelist for CMS Adapter ......... SUCCESS [0.733s]
          [INFO] Apache Stanbol Bundlelist for Contenthub .......... SUCCESS [0.764s]
          [INFO] Apache Stanbol Bundlelist for Ontology Manager .... SUCCESS [0.390s]
          [INFO] Apache Stanbol Bundlelist for Reasoners ........... SUCCESS [0.343s]
          [INFO] Apache Stanbol Bundlelist for Rules ............... SUCCESS [0.375s]
          [INFO] Apache Stanbol Bundlelist for Security ............ SUCCESS [1.123s]
          [INFO] Apache Stanbol Bundlelist for the Clerezza Shell .. SUCCESS [0.546s]
          [INFO] Apache Stanbol Bundlelist for Language Support: Smart Chinese SUCCESS [0.265s]
          [INFO] Apache Stanbol Bundlelist for Language Support: Paoding Chinese SUCCESS [0.156s]
          [INFO] Apache Stanbol Launchers Full Launcher ............ FAILURE [16.676s]
          [INFO] Apache Stanbol Launchers Stable Launcher .......... SKIPPED
          [INFO] Apache Stanbol Launchers Full Launcher as WAR ..... SKIPPED
          [INFO] Apache Stanbol Statefull Webmodule Archetype ...... SKIPPED
          [INFO] Apache Stanbol Integration Tests .................. SKIPPED
          [INFO] Apache Stanbol Reactor ............................ SKIPPED
          [INFO] ------------------------------------------------------------------------
          [INFO] BUILD FAILURE
          [INFO] ------------------------------------------------------------------------
          [INFO] Total time: 7:04.839s
          [INFO] Finished at: Mon Feb 25 12:23:12 CET 2013
          [INFO] Final Memory: 642M/989M
          [INFO] ------------------------------------------------------------------------
          [ERROR] Failed to execute goal org.apache.sling:maven-launchpad-plugin:2.2.0:prepare-package (prepare-package) on projec
          t org.apache.stanbol.launchers.full: Unable to copy bundle from C:\Dev\Stanbol\commons\web\sparql\target\classes: C:\Dev
          \Stanbol\commons\web\sparql\target\classes (Access is denied) -> [Help 1]
          [ERROR]
          [ERROR] To see the full stack trace of the errors, re-run Maven with the -e switch.
          [ERROR] Re-run Maven using the -X switch to enable full debug logging.
          [ERROR]
          [ERROR] For more information about the errors and possible solutions, please read the following articles:
          [ERROR] [Help 1] http://cwiki.apache.org/confluence/display/MAVEN/MojoExecutionException
          [ERROR]
          [ERROR] After correcting the problems, you can resume the build with the command
          [ERROR] mvn <goals> -rf :org.apache.stanbol.launchers.full

          Show
          Oak Ninja added a comment - Hi! I tried building again and got a whole lot further - latest failure stacktrace below: [INFO] ------------------------------------------------------------------------ [INFO] Reactor Summary: [INFO] [INFO] Apache Stanbol Releasing Source Assembly Descriptor SUCCESS [2.793s] [INFO] Apache Stanbol Parent ............................. SUCCESS [0.624s] [INFO] Apache Stanbol Data Parent ........................ SUCCESS [2.933s] [INFO] Apache Stanbol Data Default Configuration ......... SUCCESS [1.326s] [INFO] Apache Stanbol Data: DBpedia.org .................. SUCCESS [4.539s] [INFO] Apache Stanbol Data: Remote DBpedia.org with local cache SUCCESS [0.344s] [INFO] Apache Stanbol Data: Default ontology registries .. SUCCESS [0.234s] [INFO] Apache Stanbol Data: OpenNLP Models for Danish .... SUCCESS [0.811s] [INFO] Apache Stanbol Data: OpenNLP Models for German .... SUCCESS [1.263s] [INFO] Apache Stanbol Data: OpenNLP Models for English ... SUCCESS [1.517s] [INFO] Apache Stanbol Data: OpenNLP Models for Spanish ... SUCCESS [5.659s] [INFO] Apache Stanbol Data: OpenNLP Models for Dutch ..... SUCCESS [0.828s] [INFO] Apache Stanbol Data: OpenNLP Models for Portuguese SUCCESS [0.936s] [INFO] Apache Stanbol Data: OpenNLP Models for Swedish ... SUCCESS [0.670s] [INFO] Apache Stanbol Data: OpenNLP NER Models for English SUCCESS [1.295s] [INFO] Apache Stanbol Data: OpenNLP NER Models for Spanish SUCCESS [1.170s] [INFO] Apache Stanbol Data: OpenNLP NER Models for Dutch . SUCCESS [1.154s] [INFO] Apache Stanbol Data: SentimentWortschatz Models for German SUCCESS [0.921s] [INFO] Apache Stanbol Data: SentiWordNet Models for English SUCCESS [0.999s] [INFO] Apache Stanbol Data ............................... SUCCESS [0.265s] [INFO] Apache Stanbol Commons Framework Fragment ......... SUCCESS [4.680s] [INFO] Apache Stanbol Commons Web Base ................... SUCCESS [5.148s] [INFO] Apache Stanbol Commons Web Base Jersey ............ SUCCESS [1.825s] [INFO] Apache Stanbol Commons Web Home Page .............. SUCCESS [2.901s] [INFO] Apache Stanbol Commons Web Viewable ............... SUCCESS [0.890s] [INFO] Apache Stanbol Commons LDPath Template Rendering .. SUCCESS [1.638s] [INFO] Apache Stanbol Commons Web Message Body Writers for RDFViewable SUCCESS [1.295s] [INFO] Apache Stanbol Commons Web Template Viewable Writer SUCCESS [1.045s] [INFO] Apache Stanbol Commons Web Resources .............. SUCCESS [0.717s] [INFO] Apache Stanbol Commons Web SPARQL ................. SUCCESS [1.358s] [INFO] Apache Stanbol Commons Freemarker Utilities ....... SUCCESS [1.014s] [INFO] Apache Stanbol Commons HTTP Query Headers ......... SUCCESS [0.671s] [INFO] Apache Stanbol Commons Data File Provider ......... SUCCESS [1.404s] [INFO] Apache Stanbol Commons Data File Provider for Bundles SUCCESS [0.826s] [INFO] Apache Stanbol Commons Offline Utilities .......... SUCCESS [1.014s] [INFO] Apache Stanbol Commons Installer Bundle Provider .. SUCCESS [0.796s] [INFO] Apache Stanbol Commons Namespace Prefix Service ... SUCCESS [1.076s] [INFO] Apache Stanbol Commons Namespace Prefix Provider for Stanbol Default Mappings SUCCESS [1.404s] [INFO] Apache Stanbol Commons prefix.cc based Namespace Prefix Provider SUCCESS [1.014s] [INFO] Apache Stanbol Commons Solr Core .................. SUCCESS [5.102s] [INFO] Apache Stanbol Commons Solr Managed ............... SUCCESS [2.356s] [INFO] Apache Stanbol Commons Solr Web ................... SUCCESS [2.340s] [INFO] Apache Stanbol Commons Solr Installer ............. SUCCESS [1.356s] [INFO] Apache Stanbol Commons Solr Defauts ............... SUCCESS [0.219s] [INFO] Apache Stanbol Commons Solr Extras: Lucene Smartcn Bundle SUCCESS [0.265s] [INFO] Apache Stanbol Commons Solr Extension for Paoding Analysis SUCCESS [2.745s] [INFO] Apache Stanbol Commons Solr Extras: Lucene Stempel Bundle SUCCESS [0.141s] [INFO] Apache Stanbol Commons Jobs API ................... SUCCESS [1.264s] [INFO] Apache Stanbol Commons Jobs Web ................... SUCCESS [1.061s] [INFO] Apache Stanbol Commons Jobs Reactor ............... SUCCESS [0.031s] [INFO] Apache Stanbol Commons OpenNLP Utilities and Models SUCCESS [1.965s] [INFO] Apache Stanbol Commons OWL Bundle ................. SUCCESS [3.885s] [INFO] Apache Stanbol Commons Indexed Clerezza inMemory graph implementation SUCCESS [1.544s] [INFO] Apache Stanbol Commons JSON-LD API ................ SUCCESS [0.811s] [INFO] Apache Stanbol Commons Clerezza LDPath Repository . SUCCESS [0.952s] [INFO] Apache Stanbol Commons Launchpad .................. SUCCESS [1.341s] [INFO] Apache Stanbol Commons Security Core .............. SUCCESS [1.701s] [INFO] Apache Stanbol Commons Basic Authenticator ........ SUCCESS [1.498s] [INFO] Apache Stanbol Commons Felix Webconsole Security Provider SUCCESS [0.624s] [INFO] Apache Stanbol Commons User Management ............ SUCCESS [2.668s] [INFO] Apache Stanbol Commons CAS Light .................. SUCCESS [1.107s] [INFO] Apache Stanbol Commons Testing Jar Executor ....... SUCCESS [1.623s] [INFO] Apache Stanbol Commons Testing HTTP Testing Library SUCCESS [1.388s] [INFO] Apache Stanbol Commons Testing Stanbol Utilities .. SUCCESS [1.654s] [INFO] Apache Stanbol Commons ............................ SUCCESS [0.077s] [INFO] Apache Stanbol Entityhub .......................... SUCCESS [0.047s] [INFO] Apache Stanbol Entityhub Generic Service API ...... SUCCESS [1.670s] [INFO] Apache Stanbol Entityhub Generic Test Framework ... SUCCESS [2.230s] [INFO] Apache Stanbol Entityhub Generic Core ............. SUCCESS [3.307s] [INFO] Apache Stanbol Entityhub Model Clerezza ........... SUCCESS [2.262s] [INFO] Apache Stanbol Entityhub Query SPARQL ............. SUCCESS [1.919s] [INFO] Apache Stanbol Entityhub Site Linked Data Protocol SUCCESS [1.950s] [INFO] Apache Stanbol Entityhub Managed Site ............. SUCCESS [0.827s] [INFO] Apache Stanbol Entityhub Yard based on Clerezza ... SUCCESS [1.825s] [INFO] Apache Stanbol Entityhub Yard based on Solr ....... SUCCESS [2.653s] [INFO] Apache Stanbol Entityhub Web Jersey HTTP Endpoint . SUCCESS [4.165s] [INFO] Apache Stanbol Entityhub LDPath Support ........... SUCCESS [1.840s] [INFO] Apache Stanbol Entityhub Indexing ................. SUCCESS [0.078s] [INFO] Apache Stanbol Entityhub Indexing Core ............ SUCCESS [2.699s] [INFO] Apache Stanbol Entityhub Indexing Source for Jena TDB SUCCESS [3.542s] [INFO] Apache Stanbol Entityhub Indexing Source for vCard SUCCESS [1.466s] [INFO] Apache Stanbol Entityhub Indexing Destination SolrYard SUCCESS [3.198s] [INFO] Apache Stanbol Entityhub Indexing Generic RDF ..... SUCCESS [1.794s] [INFO] Apache Stanbol Entityhub Indexing for geonames.org SUCCESS [1.825s] [INFO] Apache Stanbol Entityhub Indexing for DBpedia.org . SUCCESS [1.170s] [INFO] Apache Stanbol Entityhub Indexing for dblp ........ SUCCESS [0.780s] [INFO] Apache Stanbol Entityhub Default Configuration .... SUCCESS [0.126s] [INFO] Apache Stanbol Ontology Manager : Services API .... SUCCESS [4.523s] [INFO] Apache Stanbol Ontology Manager : Input Sources (Clerezza-based) SUCCESS [1.669s] [INFO] Apache Stanbol Ontology Manager : Input Sources (OWL API-based) SUCCESS [1.904s] [INFO] Apache Stanbol Ontology Manager : Core ............ SUCCESS [2.511s] [INFO] Apache Stanbol Ontology Manager : Network Multiplexer (Clerezza implementation) SUCCESS [3.105s] [INFO] Apache Stanbol Ontology Manager : Registry Manager SUCCESS [4.071s] [INFO] Apache Stanbol Ontology Manager : Web ............. SUCCESS [3.744s] [INFO] Apache Stanbol Ontology Manager Reactor ........... SUCCESS [0.125s] [INFO] Apache Stanbol Rules Services API ................. SUCCESS [2.637s] [INFO] Apache Stanbol Rules Manager ...................... SUCCESS [4.539s] [INFO] Apache Stanbol Rules Abstract Adapter ............. SUCCESS [1.498s] [INFO] Apache Stanbol Rules Jena Adapter ................. SUCCESS [3.713s] [INFO] Apache Stanbol Rules SPARQL Adapter ............... SUCCESS [2.496s] [INFO] Apache Stanbol Rules Clerezza Adapter ............. SUCCESS [4.368s] [INFO] Apache Stanbol Rules SWRL Adapter ................. SUCCESS [2.636s] [INFO] Apache Stanbol Rules Adapter Reactor .............. SUCCESS [0.062s] [INFO] Apache Stanbol Rules Refactorer ................... SUCCESS [2.995s] [INFO] Apache Stanbol Rules Web .......................... SUCCESS [3.184s] [INFO] Apache Stanbol Rules Reactor ...................... SUCCESS [0.046s] [INFO] Apache Stanbol Enhancer ........................... SUCCESS [0.047s] [INFO] Apache Stanbol Enhancer Services API .............. SUCCESS [4.041s] [INFO] Apache Stanbol Enhancer Core ...................... SUCCESS [2.247s] [INFO] Apache Stanbol Enhancer Test framework ............ SUCCESS [1.403s] [INFO] Apache Stanbol Enhancer RDF entities .............. SUCCESS [2.480s] [INFO] Apache Stanbol Enhancer NLP ....................... SUCCESS [2.995s] [INFO] Apache Stanbol Enhancer NLP JSON serialization support SUCCESS [3.198s] [INFO] Apache Stanbol Enhancer Weighted Job Manager ...... SUCCESS [1.092s] [INFO] Apache Stanbol Enhancer Event Jobmanager .......... SUCCESS [2.606s] [INFO] Apache Stanbol Enhancer JobManager Reactor ........ SUCCESS [0.062s] [INFO] Apache Stanbol Enhancer Chain: DefaultChain ....... SUCCESS [0.937s] [INFO] Apache Stanbol Enhancer Chain: GraphChain ......... SUCCESS [1.044s] [INFO] Apache Stanbol Enhancer Chain: Weighted ........... SUCCESS [2.044s] [INFO] Apache Stanbol Enhancer Chain: List ............... SUCCESS [0.889s] [INFO] Apache Stanbol Enhancer Web (Jersey) .............. SUCCESS [5.601s] [INFO] Apache Stanbol Enhancer LDPath .................... SUCCESS [1.388s] [INFO] Apache Stanbol Enhancer Benchmark ................. SUCCESS [2.948s] [INFO] Apache Stanbol Enhancer Defaults Configuration .... SUCCESS [0.156s] [INFO] Apache Stanbol Contenthub ......................... SUCCESS [0.032s] [INFO] Apache Stanbol Contenthub Service API ............. SUCCESS [1.435s] [INFO] Apache Stanbol Contenthub Solr Store .............. SUCCESS [3.478s] [INFO] Apache Stanbol Contenthub Clerezza Store .......... SUCCESS [4.822s] [INFO] Apache Stanbol Contenthub InMemory Store .......... SUCCESS [1.060s] [INFO] Apache Stanbol Contenthub Store Reactor ........... SUCCESS [0.046s] [INFO] Apache Stanbol Contenthub Search Solr Searcher .... SUCCESS [3.058s] [INFO] Apache Stanbol Contenthub Search Related Keyword Searcher SUCCESS [1.873s] [INFO] Apache Stanbol Contenthub Featured Search ......... SUCCESS [3.384s] [INFO] Apache Stanbol Contenthub Search Reactor .......... SUCCESS [0.094s] [INFO] Apache Stanbol Contenthub Web ..................... SUCCESS [3.728s] [INFO] Apache Stanbol Contenthub Clerezza LDPath Backend . SUCCESS [3.542s] [INFO] Apache Stanbol Enhancement Engines ................ SUCCESS [0.062s] [INFO] Apache Stanbol Enhancement Engine : Tika .......... SUCCESS [3.370s] [INFO] Apache Stanbol Enhancement Engine : HTML Extractor SUCCESS [1.606s] [INFO] Apache Stanbol Enhancement Engine : XMP Extractor . SUCCESS [3.262s] [INFO] Apache Stanbol Enhancement Engine : Metaxa ........ SUCCESS [4.368s] [INFO] Apache Stanbol Enhancement Engine : Refactor Engine SUCCESS [3.899s] [INFO] Apache Stanbol Enhancement Engine : Language Detection SUCCESS [1.014s] [INFO] Apache Stanbol Enhancement Engine : Language Identifier SUCCESS [2.746s] [INFO] Apache Stanbol Enhancement Engine : OpenNLP ....... SUCCESS [0.062s] [INFO] Apache Stanbol Enhancement Engine : OpenNLP Sentence Detection SUCCESS [1.092s] [INFO] Apache Stanbol Enhancement Engine : OpenNLP Tokenizer SUCCESS [0.952s] [INFO] Apache Stanbol Enhancement Engine : OpenNLP POS Tagging SUCCESS [2.855s] [INFO] Apache Stanbol Enhancement Engine : OpenNLP NER ... SUCCESS [1.294s] [INFO] Apache Stanbol Enhancement Engine : OpenNLP Chunker SUCCESS [3.011s] [INFO] Apache Stanbol Enhancement Engine : Smart Chinese Tokenizer SUCCESS [1.093s] [INFO] Apache Stanbol Enhancement Engine : Paoding Chinese Tokenizer SUCCESS [2.682s] [INFO] Apache Stanbol Enhancement Engine : NLP to RDF converter SUCCESS [0.937s] [INFO] Apache Stanbol Enhancement Engine : RESTful NLP processing SUCCESS [1.311s] [INFO] Apache Stanbol Enhancement Engine : RESTful Language Identification SUCCESS [2.822s] [INFO] Apache Stanbol Enhancement Engine : Entity Linking SUCCESS [0.031s] [INFO] Apache Stanbol Enhancement Engine : Entity Linking Engine SUCCESS [2.169s] [INFO] Apache Stanbol Enhancement Engine : Entity Linking LabelTokenizer : Lucene SUCCESS [3.167s] [INFO] Apache Stanbol Enhancement Engine : Entity Linking LabelTokenizer : OpenNLP SUCCESS [1.061s] [INFO] Apache Stanbol Enhancement Engine : Entity Linking LabelTokenizer : Smart Chinese SUCCESS [0.624s] [INFO] Apache Stanbol Enhancement Engine : Entity Linking LabelTokenizer : Paoding SUCCESS [2.980s] [INFO] Apache Stanbol Enhancement Engine : Entityhub Linking SUCCESS [1.388s] [INFO] Apache Stanbol Enhancement Engine : Entity Tagging SUCCESS [1.591s] [INFO] Apache Stanbol Enhancement Engine : Keyword Extraction SUCCESS [3.650s] [INFO] Apache Stanbol Enhancement Engine : Topic Classification SUCCESS [4.369s] [INFO] Apache Stanbol Enhancement Engine : Topic Classification : Web API SUCCESS [3.619s] [INFO] Apache Stanbol Enhancement Engine : Sentiment Word Classifier SUCCESS [1.935s] [INFO] Apache Stanbol Enhancement Engine : Sentiment Summarization SUCCESS [2.901s] [INFO] Apache Stanbol Enhancer Enhancement Engine : Disambiguation using Solr MLT SUCCESS [1.295s] [INFO] Apache Stanbol Enhancement Engine : UIMA .......... SUCCESS [0.047s] [INFO] Apache Stanbol Enhancement Engine : UIMA Remote Client SUCCESS [3.697s] [INFO] Apache Stanbol Enhancement Engine : UIMA To Triples SUCCESS [1.014s] [INFO] Apache Stanbol Enhancement Engine : UIMA Local Client SUCCESS [1.950s] [INFO] Apache Stanbol Enhancement Engine : CELI Engine ... SUCCESS [4.212s] [INFO] Apache Stanbol Enhancement Engine : DBPedia Spotlight SUCCESS [1.498s] [INFO] Apache Stanbol Enhancement Engine : Geonames Linking SUCCESS [3.260s] [INFO] Apache Stanbol Enhancement Engine : OpenCalais .... SUCCESS [1.279s] [INFO] Apache Stanbol Enhancement Engine : Zemanta ....... SUCCESS [2.996s] [INFO] Apache Stanbol CMS Adapter Parent ................. SUCCESS [0.062s] [INFO] Apache Stanbol CMS Adapter Service API ............ SUCCESS [2.480s] [INFO] Apache Stanbol CMS Adapter Core ................... SUCCESS [5.242s] [INFO] Apache Stanbol CMS Adapter JCR .................... SUCCESS [2.246s] [INFO] Apache Stanbol CMS Adapter CMIS Bundle ............ SUCCESS [2.746s] [INFO] Apache Stanbol CMS Adapter Web .................... SUCCESS [3.994s] [INFO] Apache Stanbol CMS Adapter Reactor ................ SUCCESS [0.046s] [INFO] Apache Stanbol Reasoners Services API ............. SUCCESS [0.749s] [INFO] Apache Stanbol Reasoners Service Manager .......... SUCCESS [2.574s] [INFO] Apache Stanbol Reasoners OWL API .................. SUCCESS [1.436s] [INFO] Apache Stanbol Reasoners Jena ..................... SUCCESS [2.933s] [INFO] Apache Stanbol Reasoners Test Framework ........... SUCCESS [1.122s] [INFO] Apache Stanbol Reasoners Web ...................... SUCCESS [3.682s] [INFO] Apache Stanbol Reasoners Reactor .................. SUCCESS [0.047s] [INFO] Apache Stanbol Demos Enhancer VIE UI .............. SUCCESS [5.163s] [INFO] Apache Stanbol Bundlelists ........................ SUCCESS [0.047s] [INFO] Apache Stanbol Bundlelist for the OSGi Framework .. SUCCESS [0.827s] [INFO] Apache Stanbol Bundlelist for Commons Libraries ... SUCCESS [2.636s] [INFO] Apache Stanbol Bundlelist for Default Data ........ SUCCESS [0.187s] [INFO] Apache Stanbol Bundlelist for OpenNLP Models ...... SUCCESS [0.266s] [INFO] Apache Stanbol Bundlelist for Sentiment Data ...... SUCCESS [0.156s] [INFO] Apache Stanbol Bundlelist for Enhancer ............ SUCCESS [1.717s] [INFO] Apache Stanbol Bundlelist for Entityhub ........... SUCCESS [0.468s] [INFO] Apache Stanbol Bundlelist for CMS Adapter ......... SUCCESS [0.733s] [INFO] Apache Stanbol Bundlelist for Contenthub .......... SUCCESS [0.764s] [INFO] Apache Stanbol Bundlelist for Ontology Manager .... SUCCESS [0.390s] [INFO] Apache Stanbol Bundlelist for Reasoners ........... SUCCESS [0.343s] [INFO] Apache Stanbol Bundlelist for Rules ............... SUCCESS [0.375s] [INFO] Apache Stanbol Bundlelist for Security ............ SUCCESS [1.123s] [INFO] Apache Stanbol Bundlelist for the Clerezza Shell .. SUCCESS [0.546s] [INFO] Apache Stanbol Bundlelist for Language Support: Smart Chinese SUCCESS [0.265s] [INFO] Apache Stanbol Bundlelist for Language Support: Paoding Chinese SUCCESS [0.156s] [INFO] Apache Stanbol Launchers Full Launcher ............ FAILURE [16.676s] [INFO] Apache Stanbol Launchers Stable Launcher .......... SKIPPED [INFO] Apache Stanbol Launchers Full Launcher as WAR ..... SKIPPED [INFO] Apache Stanbol Statefull Webmodule Archetype ...... SKIPPED [INFO] Apache Stanbol Integration Tests .................. SKIPPED [INFO] Apache Stanbol Reactor ............................ SKIPPED [INFO] ------------------------------------------------------------------------ [INFO] BUILD FAILURE [INFO] ------------------------------------------------------------------------ [INFO] Total time: 7:04.839s [INFO] Finished at: Mon Feb 25 12:23:12 CET 2013 [INFO] Final Memory: 642M/989M [INFO] ------------------------------------------------------------------------ [ERROR] Failed to execute goal org.apache.sling:maven-launchpad-plugin:2.2.0:prepare-package (prepare-package) on projec t org.apache.stanbol.launchers.full: Unable to copy bundle from C:\Dev\Stanbol\commons\web\sparql\target\classes: C:\Dev \Stanbol\commons\web\sparql\target\classes (Access is denied) -> [Help 1] [ERROR] [ERROR] To see the full stack trace of the errors, re-run Maven with the -e switch. [ERROR] Re-run Maven using the -X switch to enable full debug logging. [ERROR] [ERROR] For more information about the errors and possible solutions, please read the following articles: [ERROR] [Help 1] http://cwiki.apache.org/confluence/display/MAVEN/MojoExecutionException [ERROR] [ERROR] After correcting the problems, you can resume the build with the command [ERROR] mvn <goals> -rf :org.apache.stanbol.launchers.full
          Hide
          Rupert Westenthaler added a comment -

          Hi

          > C:\Dev\Stanbol\commons\web\sparql\target\classes (Access is denied)

          This looks like a specific issue of your environment. But in any case it is very strange:

          (1) because I would not expect that the Apache Sling maven-launchpad-plugin accesses '\target\classes' but rather '\target'
          (2) because you are getting an 'Access is denied' error, suggesting that the user does not have access to this directory that is created by the same maven build process.
          (2b) does this folder exist?

          There should be also some information about the error above the "[INFO] Reactor Summary:" included in your comment. Do those lines contain additional informations?

          Does the same error appear if you call

          mvn clean install -rf :org.apache.stanbol.launchers.full

          Maybe this woks as in that case the bundle should be located via the local maven repository and not via modules included by the same maven command.

          Show
          Rupert Westenthaler added a comment - Hi > C:\Dev\Stanbol\commons\web\sparql\target\classes (Access is denied) This looks like a specific issue of your environment. But in any case it is very strange: (1) because I would not expect that the Apache Sling maven-launchpad-plugin accesses '\target\classes' but rather '\target' (2) because you are getting an 'Access is denied' error, suggesting that the user does not have access to this directory that is created by the same maven build process. (2b) does this folder exist? There should be also some information about the error above the " [INFO] Reactor Summary:" included in your comment. Do those lines contain additional informations? Does the same error appear if you call mvn clean install -rf :org.apache.stanbol.launchers.full Maybe this woks as in that case the bundle should be located via the local maven repository and not via modules included by the same maven command.
          Hide
          Oak Ninja added a comment -

          (1) because I would not expect that the Apache Sling maven-launchpad-plugin accesses '\target\classes' but rather '\target'
          (2) because you are getting an 'Access is denied' error, suggesting that the user does not have access to this directory that is created by the same maven build process.
          (2b) does this folder exist?
          Folder exists - explicitly ran my shell as administrator and made sure that no explorer sessions where accessing any project related folder and that solved the access issue. Now the project builds if i skip tests, but still failing with the following stacktrace if i run tests:

          1561 [main] INFO org.apache.stanbol.entityhub.indexing.core.config.IndexingConfi
          g - > rquested Resource not found
          1561 [main] INFO org.apache.stanbol.entityhub.indexing.core.config.IndexingConfi
          g - Unable to find optional configuration RdfIndexingSource.properties
          1716 [main] WARN com.hp.hpl.jena.tdb.exec - No BGP optimizer
          1716 [main] INFO org.apache.stanbol.entityhub.indexing.source.jenatdb.RdfIndexin
          gSource - Imported RDF File Folder: C:\Dev\Stanbol\entityhub\indexing\source\jen
          atdb\target\test-files\testConfigs\bnode\indexing\resources\imported
          1716 [main] INFO org.apache.stanbol.entityhub.indexing.source.jenatdb.RdfIndexin
          gSource - Importing RDF data from:
          1716 [main] INFO org.apache.stanbol.entityhub.indexing.core.config.IndexingConfi
          g - request for Resource rdfdata (folder: C:\Dev\Stanbol\entityhub\indexing\sour
          ce\jenatdb\target\test-files\testConfigs\bnode\indexing\resources)
          1716 [main] INFO org.apache.stanbol.entityhub.indexing.core.config.IndexingConfi
          g - > rquested Resource present
          1716 [main] INFO org.apache.stanbol.entityhub.indexing.source.jenatdb.RdfIndexin
          gSource - Indexing of Bnodes enabled (prefix: urn:bnode:simple:
          Tests run: 4, Failures: 4, Errors: 0, Skipped: 0, Time elapsed: 1.778 sec <<< FA
          ILURE!

          Results :

          Failed tests: testEntityDataIterable(org.apache.stanbol.entityhub.indexing.sou
          rce.jenatdb.RdfIndexingSourceTest)
          testEntityDataProvider(org.apache.stanbol.entityhub.indexing.source.jenatdb.Rd
          fIndexingSourceTest)
          testQuadsImport(org.apache.stanbol.entityhub.indexing.source.jenatdb.RdfIndexi
          ngSourceTest)
          testBNodeSupport(org.apache.stanbol.entityhub.indexing.source.jenatdb.RdfIndex
          ingSourceTest)

          Tests run: 4, Failures: 4, Errors: 0, Skipped: 0

          [INFO] ------------------------------------------------------------------------
          [INFO] Reactor Summary:
          [INFO]
          [INFO] Apache Stanbol Releasing Source Assembly Descriptor SUCCESS [1.918s]
          [INFO] Apache Stanbol Parent ............................. SUCCESS [0.562s]
          [INFO] Apache Stanbol Data Parent ........................ SUCCESS [0.483s]
          [INFO] Apache Stanbol Data Default Configuration ......... SUCCESS [3.214s]
          [INFO] Apache Stanbol Data: DBpedia.org .................. SUCCESS [8.877s]
          [INFO] Apache Stanbol Data: Remote DBpedia.org with local cache SUCCESS [0.983s
          ]
          [INFO] Apache Stanbol Data: Default ontology registries .. SUCCESS [0.530s]
          [INFO] Apache Stanbol Data: OpenNLP Models for Danish .... SUCCESS [1.342s]
          [INFO] Apache Stanbol Data: OpenNLP Models for German .... SUCCESS [3.042s]
          [INFO] Apache Stanbol Data: OpenNLP Models for English ... SUCCESS [2.636s]
          [INFO] Apache Stanbol Data: OpenNLP Models for Spanish ... SUCCESS [4.711s]
          [INFO] Apache Stanbol Data: OpenNLP Models for Dutch ..... SUCCESS [2.668s]
          [INFO] Apache Stanbol Data: OpenNLP Models for Portuguese SUCCESS [1.482s]
          [INFO] Apache Stanbol Data: OpenNLP Models for Swedish ... SUCCESS [1.294s]
          [INFO] Apache Stanbol Data: OpenNLP NER Models for English SUCCESS [3.527s]
          [INFO] Apache Stanbol Data: OpenNLP NER Models for Spanish SUCCESS [1.827s]
          [INFO] Apache Stanbol Data: OpenNLP NER Models for Dutch . SUCCESS [1.714s]
          [INFO] Apache Stanbol Data: SentimentWortschatz Models for German SUCCESS [1.35
          6s]
          [INFO] Apache Stanbol Data: SentiWordNet Models for English SUCCESS [3.620s]
          [INFO] Apache Stanbol Data ............................... SUCCESS [0.047s]
          [INFO] Apache Stanbol Commons Framework Fragment ......... SUCCESS [3.541s]
          [INFO] Apache Stanbol Commons Web Base ................... SUCCESS [2.933s]
          [INFO] Apache Stanbol Commons Web Base Jersey ............ SUCCESS [1.466s]
          [INFO] Apache Stanbol Commons Web Home Page .............. SUCCESS [1.763s]
          [INFO] Apache Stanbol Commons Web Viewable ............... SUCCESS [0.951s]
          [INFO] Apache Stanbol Commons LDPath Template Rendering .. SUCCESS [1.280s]
          [INFO] Apache Stanbol Commons Web Message Body Writers for RDFViewable SUCCESS
          [1.872s]
          [INFO] Apache Stanbol Commons Web Template Viewable Writer SUCCESS [1.025s]
          [INFO] Apache Stanbol Commons Web Resources .............. SUCCESS [0.800s]
          [INFO] Apache Stanbol Commons Web SPARQL ................. SUCCESS [1.841s]
          [INFO] Apache Stanbol Commons Freemarker Utilities ....... SUCCESS [1.700s]
          [INFO] Apache Stanbol Commons HTTP Query Headers ......... SUCCESS [0.765s]
          [INFO] Apache Stanbol Commons Data File Provider ......... SUCCESS [1.233s]
          [INFO] Apache Stanbol Commons Data File Provider for Bundles SUCCESS [0.998s]
          [INFO] Apache Stanbol Commons Offline Utilities .......... SUCCESS [0.749s]
          [INFO] Apache Stanbol Commons Installer Bundle Provider .. SUCCESS [0.920s]
          [INFO] Apache Stanbol Commons Namespace Prefix Service ... SUCCESS [1.435s]
          [INFO] Apache Stanbol Commons Namespace Prefix Provider for Stanbol Default Mapp
          ings SUCCESS [1.123s]
          [INFO] Apache Stanbol Commons prefix.cc based Namespace Prefix Provider SUCCESS
          [3.432s]
          [INFO] Apache Stanbol Commons Solr Core .................. SUCCESS [5.133s]
          [INFO] Apache Stanbol Commons Solr Managed ............... SUCCESS [4.977s]
          [INFO] Apache Stanbol Commons Solr Web ................... SUCCESS [2.134s]
          [INFO] Apache Stanbol Commons Solr Installer ............. SUCCESS [1.578s]
          [INFO] Apache Stanbol Commons Solr Defauts ............... SUCCESS [0.671s]
          [INFO] Apache Stanbol Commons Solr Extras: Lucene Smartcn Bundle SUCCESS [1.155
          s]
          [INFO] Apache Stanbol Commons Solr Extension for Paoding Analysis SUCCESS [1.41
          9s]
          [INFO] Apache Stanbol Commons Solr Extras: Lucene Stempel Bundle SUCCESS [0.826
          s]
          [INFO] Apache Stanbol Commons Jobs API ................... SUCCESS [3.167s]
          [INFO] Apache Stanbol Commons Jobs Web ................... SUCCESS [1.545s]
          [INFO] Apache Stanbol Commons Jobs Reactor ............... SUCCESS [0.047s]
          [INFO] Apache Stanbol Commons OpenNLP Utilities and Models SUCCESS [5.069s]
          [INFO] Apache Stanbol Commons OWL Bundle ................. SUCCESS [4.665s]
          [INFO] Apache Stanbol Commons Indexed Clerezza inMemory graph implementation SU
          CCESS [19.797s]
          [INFO] Apache Stanbol Commons JSON-LD API ................ SUCCESS [1.123s]
          [INFO] Apache Stanbol Commons Clerezza LDPath Repository . SUCCESS [3.557s]
          [INFO] Apache Stanbol Commons Launchpad .................. SUCCESS [0.499s]
          [INFO] Apache Stanbol Commons Security Core .............. SUCCESS [2.216s]
          [INFO] Apache Stanbol Commons Basic Authenticator ........ SUCCESS [1.217s]
          [INFO] Apache Stanbol Commons Felix Webconsole Security Provider SUCCESS [0.872
          s]
          [INFO] Apache Stanbol Commons User Management ............ SUCCESS [1.842s]
          [INFO] Apache Stanbol Commons CAS Light .................. SUCCESS [2.246s]
          [INFO] Apache Stanbol Commons Testing Jar Executor ....... SUCCESS [0.452s]
          [INFO] Apache Stanbol Commons Testing HTTP Testing Library SUCCESS [0.718s]
          [INFO] Apache Stanbol Commons Testing Stanbol Utilities .. SUCCESS [0.577s]
          [INFO] Apache Stanbol Commons ............................ SUCCESS [0.047s]
          [INFO] Apache Stanbol Entityhub .......................... SUCCESS [0.062s]
          [INFO] Apache Stanbol Entityhub Generic Service API ...... SUCCESS [1.092s]
          [INFO] Apache Stanbol Entityhub Generic Test Framework ... SUCCESS [0.858s]
          [INFO] Apache Stanbol Entityhub Generic Core ............. SUCCESS [1.950s]
          [INFO] Apache Stanbol Entityhub Model Clerezza ........... SUCCESS [1.545s]
          [INFO] Apache Stanbol Entityhub Query SPARQL ............. SUCCESS [1.419s]
          [INFO] Apache Stanbol Entityhub Site Linked Data Protocol SUCCESS [1.358s]
          [INFO] Apache Stanbol Entityhub Managed Site ............. SUCCESS [0.982s]
          [INFO] Apache Stanbol Entityhub Yard based on Clerezza ... SUCCESS [1.623s]
          [INFO] Apache Stanbol Entityhub Yard based on Solr ....... SUCCESS [9.345s]
          [INFO] Apache Stanbol Entityhub Web Jersey HTTP Endpoint . SUCCESS [2.355s]
          [INFO] Apache Stanbol Entityhub LDPath Support ........... SUCCESS [3.775s]
          [INFO] Apache Stanbol Entityhub Indexing ................. SUCCESS [0.047s]
          [INFO] Apache Stanbol Entityhub Indexing Core ............ SUCCESS [36.192s]
          [INFO] Apache Stanbol Entityhub Indexing Source for Jena TDB FAILURE [2.839s]
          [INFO] Apache Stanbol Entityhub Indexing Source for vCard SKIPPED
          [INFO] Apache Stanbol Entityhub Indexing Destination SolrYard SKIPPED
          [INFO] Apache Stanbol Entityhub Indexing Generic RDF ..... SKIPPED
          [INFO] Apache Stanbol Entityhub Indexing for geonames.org SKIPPED
          [INFO] Apache Stanbol Entityhub Indexing for DBpedia.org . SKIPPED
          [INFO] Apache Stanbol Entityhub Indexing for dblp ........ SKIPPED
          [INFO] Apache Stanbol Entityhub Default Configuration .... SKIPPED
          [INFO] Apache Stanbol Ontology Manager : Services API .... SKIPPED
          [INFO] Apache Stanbol Ontology Manager : Input Sources (Clerezza-based) SKIPPED

          [INFO] Apache Stanbol Ontology Manager : Input Sources (OWL API-based) SKIPPED
          [INFO] Apache Stanbol Ontology Manager : Core ............ SKIPPED
          [INFO] Apache Stanbol Ontology Manager : Network Multiplexer (Clerezza implement
          ation) SKIPPED
          [INFO] Apache Stanbol Ontology Manager : Registry Manager SKIPPED
          [INFO] Apache Stanbol Ontology Manager : Web ............. SKIPPED
          [INFO] Apache Stanbol Ontology Manager Reactor ........... SKIPPED
          [INFO] Apache Stanbol Rules Services API ................. SKIPPED
          [INFO] Apache Stanbol Rules Manager ...................... SKIPPED
          [INFO] Apache Stanbol Rules Abstract Adapter ............. SKIPPED
          [INFO] Apache Stanbol Rules Jena Adapter ................. SKIPPED
          [INFO] Apache Stanbol Rules SPARQL Adapter ............... SKIPPED
          [INFO] Apache Stanbol Rules Clerezza Adapter ............. SKIPPED
          [INFO] Apache Stanbol Rules SWRL Adapter ................. SKIPPED
          [INFO] Apache Stanbol Rules Adapter Reactor .............. SKIPPED
          [INFO] Apache Stanbol Rules Refactorer ................... SKIPPED
          [INFO] Apache Stanbol Rules Web .......................... SKIPPED
          [INFO] Apache Stanbol Rules Reactor ...................... SKIPPED
          [INFO] Apache Stanbol Enhancer ........................... SKIPPED
          [INFO] Apache Stanbol Enhancer Services API .............. SKIPPED
          [INFO] Apache Stanbol Enhancer Core ...................... SKIPPED
          [INFO] Apache Stanbol Enhancer Test framework ............ SKIPPED
          [INFO] Apache Stanbol Enhancer RDF entities .............. SKIPPED
          [INFO] Apache Stanbol Enhancer NLP ....................... SKIPPED
          [INFO] Apache Stanbol Enhancer NLP JSON serialization support SKIPPED
          [INFO] Apache Stanbol Enhancer Weighted Job Manager ...... SKIPPED
          [INFO] Apache Stanbol Enhancer Event Jobmanager .......... SKIPPED
          [INFO] Apache Stanbol Enhancer JobManager Reactor ........ SKIPPED
          [INFO] Apache Stanbol Enhancer Chain: DefaultChain ....... SKIPPED
          [INFO] Apache Stanbol Enhancer Chain: GraphChain ......... SKIPPED
          [INFO] Apache Stanbol Enhancer Chain: Weighted ........... SKIPPED
          [INFO] Apache Stanbol Enhancer Chain: List ............... SKIPPED
          [INFO] Apache Stanbol Enhancer Web (Jersey) .............. SKIPPED
          [INFO] Apache Stanbol Enhancer LDPath .................... SKIPPED
          [INFO] Apache Stanbol Enhancer Benchmark ................. SKIPPED
          [INFO] Apache Stanbol Enhancer Defaults Configuration .... SKIPPED
          [INFO] Apache Stanbol Contenthub ......................... SKIPPED
          [INFO] Apache Stanbol Contenthub Service API ............. SKIPPED
          [INFO] Apache Stanbol Contenthub Solr Store .............. SKIPPED
          [INFO] Apache Stanbol Contenthub Clerezza Store .......... SKIPPED
          [INFO] Apache Stanbol Contenthub InMemory Store .......... SKIPPED
          [INFO] Apache Stanbol Contenthub Store Reactor ........... SKIPPED
          [INFO] Apache Stanbol Contenthub Search Solr Searcher .... SKIPPED
          [INFO] Apache Stanbol Contenthub Search Related Keyword Searcher SKIPPED
          [INFO] Apache Stanbol Contenthub Featured Search ......... SKIPPED
          [INFO] Apache Stanbol Contenthub Search Reactor .......... SKIPPED
          [INFO] Apache Stanbol Contenthub Web ..................... SKIPPED
          [INFO] Apache Stanbol Contenthub Clerezza LDPath Backend . SKIPPED
          [INFO] Apache Stanbol Enhancement Engines ................ SKIPPED
          [INFO] Apache Stanbol Enhancement Engine : Tika .......... SKIPPED
          [INFO] Apache Stanbol Enhancement Engine : HTML Extractor SKIPPED
          [INFO] Apache Stanbol Enhancement Engine : XMP Extractor . SKIPPED
          [INFO] Apache Stanbol Enhancement Engine : Metaxa ........ SKIPPED
          [INFO] Apache Stanbol Enhancement Engine : Refactor Engine SKIPPED
          [INFO] Apache Stanbol Enhancement Engine : Language Detection SKIPPED
          [INFO] Apache Stanbol Enhancement Engine : Language Identifier SKIPPED
          [INFO] Apache Stanbol Enhancement Engine : OpenNLP ....... SKIPPED
          [INFO] Apache Stanbol Enhancement Engine : OpenNLP Sentence Detection SKIPPED
          [INFO] Apache Stanbol Enhancement Engine : OpenNLP Tokenizer SKIPPED
          [INFO] Apache Stanbol Enhancement Engine : OpenNLP POS Tagging SKIPPED
          [INFO] Apache Stanbol Enhancement Engine : OpenNLP NER ... SKIPPED
          [INFO] Apache Stanbol Enhancement Engine : OpenNLP Chunker SKIPPED
          [INFO] Apache Stanbol Enhancement Engine : Smart Chinese Tokenizer SKIPPED
          [INFO] Apache Stanbol Enhancement Engine : Paoding Chinese Tokenizer SKIPPED
          [INFO] Apache Stanbol Enhancement Engine : NLP to RDF converter SKIPPED
          [INFO] Apache Stanbol Enhancement Engine : RESTful NLP processing SKIPPED
          [INFO] Apache Stanbol Enhancement Engine : RESTful Language Identification SKIP
          PED
          [INFO] Apache Stanbol Enhancement Engine : Entity Linking SKIPPED
          [INFO] Apache Stanbol Enhancement Engine : Entity Linking Engine SKIPPED
          [INFO] Apache Stanbol Enhancement Engine : Entity Linking LabelTokenizer : Lucen
          e SKIPPED
          [INFO] Apache Stanbol Enhancement Engine : Entity Linking LabelTokenizer : OpenN
          LP SKIPPED
          [INFO] Apache Stanbol Enhancement Engine : Entity Linking LabelTokenizer : Smart
          Chinese SKIPPED
          [INFO] Apache Stanbol Enhancement Engine : Entity Linking LabelTokenizer : Paodi
          ng SKIPPED
          [INFO] Apache Stanbol Enhancement Engine : Entityhub Linking SKIPPED
          [INFO] Apache Stanbol Enhancement Engine : Entity Tagging SKIPPED
          [INFO] Apache Stanbol Enhancement Engine : Keyword Extraction SKIPPED
          [INFO] Apache Stanbol Enhancement Engine : Topic Classification SKIPPED
          [INFO] Apache Stanbol Enhancement Engine : Topic Classification : Web API SKIPP
          ED
          [INFO] Apache Stanbol Enhancement Engine : Sentiment Word Classifier SKIPPED
          [INFO] Apache Stanbol Enhancement Engine : Sentiment Summarization SKIPPED
          [INFO] Apache Stanbol Enhancer Enhancement Engine : Disambiguation using Solr ML
          T SKIPPED
          [INFO] Apache Stanbol Enhancement Engine : UIMA .......... SKIPPED
          [INFO] Apache Stanbol Enhancement Engine : UIMA Remote Client SKIPPED
          [INFO] Apache Stanbol Enhancement Engine : UIMA To Triples SKIPPED
          [INFO] Apache Stanbol Enhancement Engine : UIMA Local Client SKIPPED
          [INFO] Apache Stanbol Enhancement Engine : CELI Engine ... SKIPPED
          [INFO] Apache Stanbol Enhancement Engine : DBPedia Spotlight SKIPPED
          [INFO] Apache Stanbol Enhancement Engine : Geonames Linking SKIPPED
          [INFO] Apache Stanbol Enhancement Engine : OpenCalais .... SKIPPED
          [INFO] Apache Stanbol Enhancement Engine : Zemanta ....... SKIPPED
          [INFO] Apache Stanbol CMS Adapter Parent ................. SKIPPED
          [INFO] Apache Stanbol CMS Adapter Service API ............ SKIPPED
          [INFO] Apache Stanbol CMS Adapter Core ................... SKIPPED
          [INFO] Apache Stanbol CMS Adapter JCR .................... SKIPPED
          [INFO] Apache Stanbol CMS Adapter CMIS Bundle ............ SKIPPED
          [INFO] Apache Stanbol CMS Adapter Web .................... SKIPPED
          [INFO] Apache Stanbol CMS Adapter Reactor ................ SKIPPED
          [INFO] Apache Stanbol Reasoners Services API ............. SKIPPED
          [INFO] Apache Stanbol Reasoners Service Manager .......... SKIPPED
          [INFO] Apache Stanbol Reasoners OWL API .................. SKIPPED
          [INFO] Apache Stanbol Reasoners Jena ..................... SKIPPED
          [INFO] Apache Stanbol Reasoners Test Framework ........... SKIPPED
          [INFO] Apache Stanbol Reasoners Web ...................... SKIPPED
          [INFO] Apache Stanbol Reasoners Reactor .................. SKIPPED
          [INFO] Apache Stanbol Demos Enhancer VIE UI .............. SKIPPED
          [INFO] Apache Stanbol Bundlelists ........................ SKIPPED
          [INFO] Apache Stanbol Bundlelist for the OSGi Framework .. SKIPPED
          [INFO] Apache Stanbol Bundlelist for Commons Libraries ... SKIPPED
          [INFO] Apache Stanbol Bundlelist for Default Data ........ SKIPPED
          [INFO] Apache Stanbol Bundlelist for OpenNLP Models ...... SKIPPED
          [INFO] Apache Stanbol Bundlelist for Sentiment Data ...... SKIPPED
          [INFO] Apache Stanbol Bundlelist for Enhancer ............ SKIPPED
          [INFO] Apache Stanbol Bundlelist for Entityhub ........... SKIPPED
          [INFO] Apache Stanbol Bundlelist for CMS Adapter ......... SKIPPED
          [INFO] Apache Stanbol Bundlelist for Contenthub .......... SKIPPED
          [INFO] Apache Stanbol Bundlelist for Ontology Manager .... SKIPPED
          [INFO] Apache Stanbol Bundlelist for Reasoners ........... SKIPPED
          [INFO] Apache Stanbol Bundlelist for Rules ............... SKIPPED
          [INFO] Apache Stanbol Bundlelist for Security ............ SKIPPED
          [INFO] Apache Stanbol Bundlelist for the Clerezza Shell .. SKIPPED
          [INFO] Apache Stanbol Bundlelist for Language Support: Smart Chinese SKIPPED
          [INFO] Apache Stanbol Bundlelist for Language Support: Paoding Chinese SKIPPED
          [INFO] Apache Stanbol Launchers Full Launcher ............ SKIPPED
          [INFO] Apache Stanbol Launchers Stable Launcher .......... SKIPPED
          [INFO] Apache Stanbol Launchers Full Launcher as WAR ..... SKIPPED
          [INFO] Apache Stanbol Statefull Webmodule Archetype ...... SKIPPED
          [INFO] Apache Stanbol Integration Tests .................. SKIPPED
          [INFO] Apache Stanbol Reactor ............................ SKIPPED
          [INFO] ------------------------------------------------------------------------
          [INFO] BUILD FAILURE
          [INFO] ------------------------------------------------------------------------
          [INFO] Total time: 3:36.827s
          [INFO] Finished at: Mon Feb 25 14:54:51 CET 2013
          [INFO] Final Memory: 100M/238M
          [INFO] ------------------------------------------------------------------------
          [ERROR] Failed to execute goal org.apache.maven.plugins:maven-surefire-plugin:2.
          11:test (default-test) on project org.apache.stanbol.entityhub.indexing.source.j
          enatdb: There are test failures.
          [ERROR]
          [ERROR] Please refer to C:\Dev\Stanbol\entityhub\indexing\source\jenatdb\target\
          surefire-reports for the individual test results.
          [ERROR] -> [Help 1]
          [ERROR]
          [ERROR] To see the full stack trace of the errors, re-run Maven with the -e swit
          ch.
          [ERROR] Re-run Maven using the -X switch to enable full debug logging.
          [ERROR]
          [ERROR] For more information about the errors and possible solutions, please rea
          d the following articles:
          [ERROR] [Help 1] http://cwiki.apache.org/confluence/display/MAVEN/MojoFailureExc
          eption
          [ERROR]
          [ERROR] After correcting the problems, you can resume the build with the command

          [ERROR] mvn <goals> -rf :org.apache.stanbol.entityhub.indexing.source.jenatdb

          Show
          Oak Ninja added a comment - (1) because I would not expect that the Apache Sling maven-launchpad-plugin accesses '\target\classes' but rather '\target' (2) because you are getting an 'Access is denied' error, suggesting that the user does not have access to this directory that is created by the same maven build process. (2b) does this folder exist? Folder exists - explicitly ran my shell as administrator and made sure that no explorer sessions where accessing any project related folder and that solved the access issue. Now the project builds if i skip tests, but still failing with the following stacktrace if i run tests: 1561 [main] INFO org.apache.stanbol.entityhub.indexing.core.config.IndexingConfi g - > rquested Resource not found 1561 [main] INFO org.apache.stanbol.entityhub.indexing.core.config.IndexingConfi g - Unable to find optional configuration RdfIndexingSource.properties 1716 [main] WARN com.hp.hpl.jena.tdb.exec - No BGP optimizer 1716 [main] INFO org.apache.stanbol.entityhub.indexing.source.jenatdb.RdfIndexin gSource - Imported RDF File Folder: C:\Dev\Stanbol\entityhub\indexing\source\jen atdb\target\test-files\testConfigs\bnode\indexing\resources\imported 1716 [main] INFO org.apache.stanbol.entityhub.indexing.source.jenatdb.RdfIndexin gSource - Importing RDF data from: 1716 [main] INFO org.apache.stanbol.entityhub.indexing.core.config.IndexingConfi g - request for Resource rdfdata (folder: C:\Dev\Stanbol\entityhub\indexing\sour ce\jenatdb\target\test-files\testConfigs\bnode\indexing\resources) 1716 [main] INFO org.apache.stanbol.entityhub.indexing.core.config.IndexingConfi g - > rquested Resource present 1716 [main] INFO org.apache.stanbol.entityhub.indexing.source.jenatdb.RdfIndexin gSource - Indexing of Bnodes enabled (prefix: urn:bnode:simple: Tests run: 4, Failures: 4, Errors: 0, Skipped: 0, Time elapsed: 1.778 sec <<< FA ILURE! Results : Failed tests: testEntityDataIterable(org.apache.stanbol.entityhub.indexing.sou rce.jenatdb.RdfIndexingSourceTest) testEntityDataProvider(org.apache.stanbol.entityhub.indexing.source.jenatdb.Rd fIndexingSourceTest) testQuadsImport(org.apache.stanbol.entityhub.indexing.source.jenatdb.RdfIndexi ngSourceTest) testBNodeSupport(org.apache.stanbol.entityhub.indexing.source.jenatdb.RdfIndex ingSourceTest) Tests run: 4, Failures: 4, Errors: 0, Skipped: 0 [INFO] ------------------------------------------------------------------------ [INFO] Reactor Summary: [INFO] [INFO] Apache Stanbol Releasing Source Assembly Descriptor SUCCESS [1.918s] [INFO] Apache Stanbol Parent ............................. SUCCESS [0.562s] [INFO] Apache Stanbol Data Parent ........................ SUCCESS [0.483s] [INFO] Apache Stanbol Data Default Configuration ......... SUCCESS [3.214s] [INFO] Apache Stanbol Data: DBpedia.org .................. SUCCESS [8.877s] [INFO] Apache Stanbol Data: Remote DBpedia.org with local cache SUCCESS [0.983s ] [INFO] Apache Stanbol Data: Default ontology registries .. SUCCESS [0.530s] [INFO] Apache Stanbol Data: OpenNLP Models for Danish .... SUCCESS [1.342s] [INFO] Apache Stanbol Data: OpenNLP Models for German .... SUCCESS [3.042s] [INFO] Apache Stanbol Data: OpenNLP Models for English ... SUCCESS [2.636s] [INFO] Apache Stanbol Data: OpenNLP Models for Spanish ... SUCCESS [4.711s] [INFO] Apache Stanbol Data: OpenNLP Models for Dutch ..... SUCCESS [2.668s] [INFO] Apache Stanbol Data: OpenNLP Models for Portuguese SUCCESS [1.482s] [INFO] Apache Stanbol Data: OpenNLP Models for Swedish ... SUCCESS [1.294s] [INFO] Apache Stanbol Data: OpenNLP NER Models for English SUCCESS [3.527s] [INFO] Apache Stanbol Data: OpenNLP NER Models for Spanish SUCCESS [1.827s] [INFO] Apache Stanbol Data: OpenNLP NER Models for Dutch . SUCCESS [1.714s] [INFO] Apache Stanbol Data: SentimentWortschatz Models for German SUCCESS [1.35 6s] [INFO] Apache Stanbol Data: SentiWordNet Models for English SUCCESS [3.620s] [INFO] Apache Stanbol Data ............................... SUCCESS [0.047s] [INFO] Apache Stanbol Commons Framework Fragment ......... SUCCESS [3.541s] [INFO] Apache Stanbol Commons Web Base ................... SUCCESS [2.933s] [INFO] Apache Stanbol Commons Web Base Jersey ............ SUCCESS [1.466s] [INFO] Apache Stanbol Commons Web Home Page .............. SUCCESS [1.763s] [INFO] Apache Stanbol Commons Web Viewable ............... SUCCESS [0.951s] [INFO] Apache Stanbol Commons LDPath Template Rendering .. SUCCESS [1.280s] [INFO] Apache Stanbol Commons Web Message Body Writers for RDFViewable SUCCESS [1.872s] [INFO] Apache Stanbol Commons Web Template Viewable Writer SUCCESS [1.025s] [INFO] Apache Stanbol Commons Web Resources .............. SUCCESS [0.800s] [INFO] Apache Stanbol Commons Web SPARQL ................. SUCCESS [1.841s] [INFO] Apache Stanbol Commons Freemarker Utilities ....... SUCCESS [1.700s] [INFO] Apache Stanbol Commons HTTP Query Headers ......... SUCCESS [0.765s] [INFO] Apache Stanbol Commons Data File Provider ......... SUCCESS [1.233s] [INFO] Apache Stanbol Commons Data File Provider for Bundles SUCCESS [0.998s] [INFO] Apache Stanbol Commons Offline Utilities .......... SUCCESS [0.749s] [INFO] Apache Stanbol Commons Installer Bundle Provider .. SUCCESS [0.920s] [INFO] Apache Stanbol Commons Namespace Prefix Service ... SUCCESS [1.435s] [INFO] Apache Stanbol Commons Namespace Prefix Provider for Stanbol Default Mapp ings SUCCESS [1.123s] [INFO] Apache Stanbol Commons prefix.cc based Namespace Prefix Provider SUCCESS [3.432s] [INFO] Apache Stanbol Commons Solr Core .................. SUCCESS [5.133s] [INFO] Apache Stanbol Commons Solr Managed ............... SUCCESS [4.977s] [INFO] Apache Stanbol Commons Solr Web ................... SUCCESS [2.134s] [INFO] Apache Stanbol Commons Solr Installer ............. SUCCESS [1.578s] [INFO] Apache Stanbol Commons Solr Defauts ............... SUCCESS [0.671s] [INFO] Apache Stanbol Commons Solr Extras: Lucene Smartcn Bundle SUCCESS [1.155 s] [INFO] Apache Stanbol Commons Solr Extension for Paoding Analysis SUCCESS [1.41 9s] [INFO] Apache Stanbol Commons Solr Extras: Lucene Stempel Bundle SUCCESS [0.826 s] [INFO] Apache Stanbol Commons Jobs API ................... SUCCESS [3.167s] [INFO] Apache Stanbol Commons Jobs Web ................... SUCCESS [1.545s] [INFO] Apache Stanbol Commons Jobs Reactor ............... SUCCESS [0.047s] [INFO] Apache Stanbol Commons OpenNLP Utilities and Models SUCCESS [5.069s] [INFO] Apache Stanbol Commons OWL Bundle ................. SUCCESS [4.665s] [INFO] Apache Stanbol Commons Indexed Clerezza inMemory graph implementation SU CCESS [19.797s] [INFO] Apache Stanbol Commons JSON-LD API ................ SUCCESS [1.123s] [INFO] Apache Stanbol Commons Clerezza LDPath Repository . SUCCESS [3.557s] [INFO] Apache Stanbol Commons Launchpad .................. SUCCESS [0.499s] [INFO] Apache Stanbol Commons Security Core .............. SUCCESS [2.216s] [INFO] Apache Stanbol Commons Basic Authenticator ........ SUCCESS [1.217s] [INFO] Apache Stanbol Commons Felix Webconsole Security Provider SUCCESS [0.872 s] [INFO] Apache Stanbol Commons User Management ............ SUCCESS [1.842s] [INFO] Apache Stanbol Commons CAS Light .................. SUCCESS [2.246s] [INFO] Apache Stanbol Commons Testing Jar Executor ....... SUCCESS [0.452s] [INFO] Apache Stanbol Commons Testing HTTP Testing Library SUCCESS [0.718s] [INFO] Apache Stanbol Commons Testing Stanbol Utilities .. SUCCESS [0.577s] [INFO] Apache Stanbol Commons ............................ SUCCESS [0.047s] [INFO] Apache Stanbol Entityhub .......................... SUCCESS [0.062s] [INFO] Apache Stanbol Entityhub Generic Service API ...... SUCCESS [1.092s] [INFO] Apache Stanbol Entityhub Generic Test Framework ... SUCCESS [0.858s] [INFO] Apache Stanbol Entityhub Generic Core ............. SUCCESS [1.950s] [INFO] Apache Stanbol Entityhub Model Clerezza ........... SUCCESS [1.545s] [INFO] Apache Stanbol Entityhub Query SPARQL ............. SUCCESS [1.419s] [INFO] Apache Stanbol Entityhub Site Linked Data Protocol SUCCESS [1.358s] [INFO] Apache Stanbol Entityhub Managed Site ............. SUCCESS [0.982s] [INFO] Apache Stanbol Entityhub Yard based on Clerezza ... SUCCESS [1.623s] [INFO] Apache Stanbol Entityhub Yard based on Solr ....... SUCCESS [9.345s] [INFO] Apache Stanbol Entityhub Web Jersey HTTP Endpoint . SUCCESS [2.355s] [INFO] Apache Stanbol Entityhub LDPath Support ........... SUCCESS [3.775s] [INFO] Apache Stanbol Entityhub Indexing ................. SUCCESS [0.047s] [INFO] Apache Stanbol Entityhub Indexing Core ............ SUCCESS [36.192s] [INFO] Apache Stanbol Entityhub Indexing Source for Jena TDB FAILURE [2.839s] [INFO] Apache Stanbol Entityhub Indexing Source for vCard SKIPPED [INFO] Apache Stanbol Entityhub Indexing Destination SolrYard SKIPPED [INFO] Apache Stanbol Entityhub Indexing Generic RDF ..... SKIPPED [INFO] Apache Stanbol Entityhub Indexing for geonames.org SKIPPED [INFO] Apache Stanbol Entityhub Indexing for DBpedia.org . SKIPPED [INFO] Apache Stanbol Entityhub Indexing for dblp ........ SKIPPED [INFO] Apache Stanbol Entityhub Default Configuration .... SKIPPED [INFO] Apache Stanbol Ontology Manager : Services API .... SKIPPED [INFO] Apache Stanbol Ontology Manager : Input Sources (Clerezza-based) SKIPPED [INFO] Apache Stanbol Ontology Manager : Input Sources (OWL API-based) SKIPPED [INFO] Apache Stanbol Ontology Manager : Core ............ SKIPPED [INFO] Apache Stanbol Ontology Manager : Network Multiplexer (Clerezza implement ation) SKIPPED [INFO] Apache Stanbol Ontology Manager : Registry Manager SKIPPED [INFO] Apache Stanbol Ontology Manager : Web ............. SKIPPED [INFO] Apache Stanbol Ontology Manager Reactor ........... SKIPPED [INFO] Apache Stanbol Rules Services API ................. SKIPPED [INFO] Apache Stanbol Rules Manager ...................... SKIPPED [INFO] Apache Stanbol Rules Abstract Adapter ............. SKIPPED [INFO] Apache Stanbol Rules Jena Adapter ................. SKIPPED [INFO] Apache Stanbol Rules SPARQL Adapter ............... SKIPPED [INFO] Apache Stanbol Rules Clerezza Adapter ............. SKIPPED [INFO] Apache Stanbol Rules SWRL Adapter ................. SKIPPED [INFO] Apache Stanbol Rules Adapter Reactor .............. SKIPPED [INFO] Apache Stanbol Rules Refactorer ................... SKIPPED [INFO] Apache Stanbol Rules Web .......................... SKIPPED [INFO] Apache Stanbol Rules Reactor ...................... SKIPPED [INFO] Apache Stanbol Enhancer ........................... SKIPPED [INFO] Apache Stanbol Enhancer Services API .............. SKIPPED [INFO] Apache Stanbol Enhancer Core ...................... SKIPPED [INFO] Apache Stanbol Enhancer Test framework ............ SKIPPED [INFO] Apache Stanbol Enhancer RDF entities .............. SKIPPED [INFO] Apache Stanbol Enhancer NLP ....................... SKIPPED [INFO] Apache Stanbol Enhancer NLP JSON serialization support SKIPPED [INFO] Apache Stanbol Enhancer Weighted Job Manager ...... SKIPPED [INFO] Apache Stanbol Enhancer Event Jobmanager .......... SKIPPED [INFO] Apache Stanbol Enhancer JobManager Reactor ........ SKIPPED [INFO] Apache Stanbol Enhancer Chain: DefaultChain ....... SKIPPED [INFO] Apache Stanbol Enhancer Chain: GraphChain ......... SKIPPED [INFO] Apache Stanbol Enhancer Chain: Weighted ........... SKIPPED [INFO] Apache Stanbol Enhancer Chain: List ............... SKIPPED [INFO] Apache Stanbol Enhancer Web (Jersey) .............. SKIPPED [INFO] Apache Stanbol Enhancer LDPath .................... SKIPPED [INFO] Apache Stanbol Enhancer Benchmark ................. SKIPPED [INFO] Apache Stanbol Enhancer Defaults Configuration .... SKIPPED [INFO] Apache Stanbol Contenthub ......................... SKIPPED [INFO] Apache Stanbol Contenthub Service API ............. SKIPPED [INFO] Apache Stanbol Contenthub Solr Store .............. SKIPPED [INFO] Apache Stanbol Contenthub Clerezza Store .......... SKIPPED [INFO] Apache Stanbol Contenthub InMemory Store .......... SKIPPED [INFO] Apache Stanbol Contenthub Store Reactor ........... SKIPPED [INFO] Apache Stanbol Contenthub Search Solr Searcher .... SKIPPED [INFO] Apache Stanbol Contenthub Search Related Keyword Searcher SKIPPED [INFO] Apache Stanbol Contenthub Featured Search ......... SKIPPED [INFO] Apache Stanbol Contenthub Search Reactor .......... SKIPPED [INFO] Apache Stanbol Contenthub Web ..................... SKIPPED [INFO] Apache Stanbol Contenthub Clerezza LDPath Backend . SKIPPED [INFO] Apache Stanbol Enhancement Engines ................ SKIPPED [INFO] Apache Stanbol Enhancement Engine : Tika .......... SKIPPED [INFO] Apache Stanbol Enhancement Engine : HTML Extractor SKIPPED [INFO] Apache Stanbol Enhancement Engine : XMP Extractor . SKIPPED [INFO] Apache Stanbol Enhancement Engine : Metaxa ........ SKIPPED [INFO] Apache Stanbol Enhancement Engine : Refactor Engine SKIPPED [INFO] Apache Stanbol Enhancement Engine : Language Detection SKIPPED [INFO] Apache Stanbol Enhancement Engine : Language Identifier SKIPPED [INFO] Apache Stanbol Enhancement Engine : OpenNLP ....... SKIPPED [INFO] Apache Stanbol Enhancement Engine : OpenNLP Sentence Detection SKIPPED [INFO] Apache Stanbol Enhancement Engine : OpenNLP Tokenizer SKIPPED [INFO] Apache Stanbol Enhancement Engine : OpenNLP POS Tagging SKIPPED [INFO] Apache Stanbol Enhancement Engine : OpenNLP NER ... SKIPPED [INFO] Apache Stanbol Enhancement Engine : OpenNLP Chunker SKIPPED [INFO] Apache Stanbol Enhancement Engine : Smart Chinese Tokenizer SKIPPED [INFO] Apache Stanbol Enhancement Engine : Paoding Chinese Tokenizer SKIPPED [INFO] Apache Stanbol Enhancement Engine : NLP to RDF converter SKIPPED [INFO] Apache Stanbol Enhancement Engine : RESTful NLP processing SKIPPED [INFO] Apache Stanbol Enhancement Engine : RESTful Language Identification SKIP PED [INFO] Apache Stanbol Enhancement Engine : Entity Linking SKIPPED [INFO] Apache Stanbol Enhancement Engine : Entity Linking Engine SKIPPED [INFO] Apache Stanbol Enhancement Engine : Entity Linking LabelTokenizer : Lucen e SKIPPED [INFO] Apache Stanbol Enhancement Engine : Entity Linking LabelTokenizer : OpenN LP SKIPPED [INFO] Apache Stanbol Enhancement Engine : Entity Linking LabelTokenizer : Smart Chinese SKIPPED [INFO] Apache Stanbol Enhancement Engine : Entity Linking LabelTokenizer : Paodi ng SKIPPED [INFO] Apache Stanbol Enhancement Engine : Entityhub Linking SKIPPED [INFO] Apache Stanbol Enhancement Engine : Entity Tagging SKIPPED [INFO] Apache Stanbol Enhancement Engine : Keyword Extraction SKIPPED [INFO] Apache Stanbol Enhancement Engine : Topic Classification SKIPPED [INFO] Apache Stanbol Enhancement Engine : Topic Classification : Web API SKIPP ED [INFO] Apache Stanbol Enhancement Engine : Sentiment Word Classifier SKIPPED [INFO] Apache Stanbol Enhancement Engine : Sentiment Summarization SKIPPED [INFO] Apache Stanbol Enhancer Enhancement Engine : Disambiguation using Solr ML T SKIPPED [INFO] Apache Stanbol Enhancement Engine : UIMA .......... SKIPPED [INFO] Apache Stanbol Enhancement Engine : UIMA Remote Client SKIPPED [INFO] Apache Stanbol Enhancement Engine : UIMA To Triples SKIPPED [INFO] Apache Stanbol Enhancement Engine : UIMA Local Client SKIPPED [INFO] Apache Stanbol Enhancement Engine : CELI Engine ... SKIPPED [INFO] Apache Stanbol Enhancement Engine : DBPedia Spotlight SKIPPED [INFO] Apache Stanbol Enhancement Engine : Geonames Linking SKIPPED [INFO] Apache Stanbol Enhancement Engine : OpenCalais .... SKIPPED [INFO] Apache Stanbol Enhancement Engine : Zemanta ....... SKIPPED [INFO] Apache Stanbol CMS Adapter Parent ................. SKIPPED [INFO] Apache Stanbol CMS Adapter Service API ............ SKIPPED [INFO] Apache Stanbol CMS Adapter Core ................... SKIPPED [INFO] Apache Stanbol CMS Adapter JCR .................... SKIPPED [INFO] Apache Stanbol CMS Adapter CMIS Bundle ............ SKIPPED [INFO] Apache Stanbol CMS Adapter Web .................... SKIPPED [INFO] Apache Stanbol CMS Adapter Reactor ................ SKIPPED [INFO] Apache Stanbol Reasoners Services API ............. SKIPPED [INFO] Apache Stanbol Reasoners Service Manager .......... SKIPPED [INFO] Apache Stanbol Reasoners OWL API .................. SKIPPED [INFO] Apache Stanbol Reasoners Jena ..................... SKIPPED [INFO] Apache Stanbol Reasoners Test Framework ........... SKIPPED [INFO] Apache Stanbol Reasoners Web ...................... SKIPPED [INFO] Apache Stanbol Reasoners Reactor .................. SKIPPED [INFO] Apache Stanbol Demos Enhancer VIE UI .............. SKIPPED [INFO] Apache Stanbol Bundlelists ........................ SKIPPED [INFO] Apache Stanbol Bundlelist for the OSGi Framework .. SKIPPED [INFO] Apache Stanbol Bundlelist for Commons Libraries ... SKIPPED [INFO] Apache Stanbol Bundlelist for Default Data ........ SKIPPED [INFO] Apache Stanbol Bundlelist for OpenNLP Models ...... SKIPPED [INFO] Apache Stanbol Bundlelist for Sentiment Data ...... SKIPPED [INFO] Apache Stanbol Bundlelist for Enhancer ............ SKIPPED [INFO] Apache Stanbol Bundlelist for Entityhub ........... SKIPPED [INFO] Apache Stanbol Bundlelist for CMS Adapter ......... SKIPPED [INFO] Apache Stanbol Bundlelist for Contenthub .......... SKIPPED [INFO] Apache Stanbol Bundlelist for Ontology Manager .... SKIPPED [INFO] Apache Stanbol Bundlelist for Reasoners ........... SKIPPED [INFO] Apache Stanbol Bundlelist for Rules ............... SKIPPED [INFO] Apache Stanbol Bundlelist for Security ............ SKIPPED [INFO] Apache Stanbol Bundlelist for the Clerezza Shell .. SKIPPED [INFO] Apache Stanbol Bundlelist for Language Support: Smart Chinese SKIPPED [INFO] Apache Stanbol Bundlelist for Language Support: Paoding Chinese SKIPPED [INFO] Apache Stanbol Launchers Full Launcher ............ SKIPPED [INFO] Apache Stanbol Launchers Stable Launcher .......... SKIPPED [INFO] Apache Stanbol Launchers Full Launcher as WAR ..... SKIPPED [INFO] Apache Stanbol Statefull Webmodule Archetype ...... SKIPPED [INFO] Apache Stanbol Integration Tests .................. SKIPPED [INFO] Apache Stanbol Reactor ............................ SKIPPED [INFO] ------------------------------------------------------------------------ [INFO] BUILD FAILURE [INFO] ------------------------------------------------------------------------ [INFO] Total time: 3:36.827s [INFO] Finished at: Mon Feb 25 14:54:51 CET 2013 [INFO] Final Memory: 100M/238M [INFO] ------------------------------------------------------------------------ [ERROR] Failed to execute goal org.apache.maven.plugins:maven-surefire-plugin:2. 11:test (default-test) on project org.apache.stanbol.entityhub.indexing.source.j enatdb: There are test failures. [ERROR] [ERROR] Please refer to C:\Dev\Stanbol\entityhub\indexing\source\jenatdb\target\ surefire-reports for the individual test results. [ERROR] -> [Help 1] [ERROR] [ERROR] To see the full stack trace of the errors, re-run Maven with the -e swit ch. [ERROR] Re-run Maven using the -X switch to enable full debug logging. [ERROR] [ERROR] For more information about the errors and possible solutions, please rea d the following articles: [ERROR] [Help 1] http://cwiki.apache.org/confluence/display/MAVEN/MojoFailureExc eption [ERROR] [ERROR] After correcting the problems, you can resume the build with the command [ERROR] mvn <goals> -rf :org.apache.stanbol.entityhub.indexing.source.jenatdb
          Hide
          Rupert Westenthaler added a comment -

          can you please attach the surefire reports in

          C:\Dev\Stanbol\entityhub\indexing\source\jenatdb\target\surefire-reports

          to this issue. I do need only the *.txt file(s). You can exclude the *.xml versions

          thanks
          Rupert

          Show
          Rupert Westenthaler added a comment - can you please attach the surefire reports in C:\Dev\Stanbol\entityhub\indexing\source\jenatdb\target\surefire-reports to this issue. I do need only the *.txt file(s). You can exclude the *.xml versions thanks Rupert
          Show
          Oak Ninja added a comment - Report attached to this ticket, link here: https://issues.apache.org/jira/secure/attachment/12570792/org.apache.stanbol.entityhub.indexing.source.jenatdb.RdfIndexingSourceTest.txt Revision 1449651
          Hide
          Rupert Westenthaler added a comment -

          Hi Oak

          looks like that there are a lot more things are broken with Windows 8 ...

          The error indicates that the data used by the unit test are not successfully copied from 'src/test/resources/testConfigs' to 'target/test-files/testConfigs' and therefore the 'target/test-files/testConfigs/

          {test-name}

          /indexing/resources/rdfdata' folder should be empty on your machine. If this is the case than I would the test fail with exactly the message as in the attached surefire-report.

          I had already a look at the source and I found some potential problems with the initialization of the default configuration on Windows (related with the use of '\' when loading resources from JAR files). However I do not think that this is the cause for your problem as the failing tests do provide their own configuration and do not need this feature.

          With revision 1450067 I committed those changes and I also improved logging for the unit tests. So please svn up and than go to '

          {trunk}

          /entityhub/indexing/source/jenatdb' and run

          mvn clean install

          If the test still fails please attach the command line loggings to this issue (on linux I would use 'mvn clean install > jenatdb-build.log' to generate this file).

          thx for all your help
          best
          Rupert

          Show
          Rupert Westenthaler added a comment - Hi Oak looks like that there are a lot more things are broken with Windows 8 ... The error indicates that the data used by the unit test are not successfully copied from 'src/test/resources/testConfigs' to 'target/test-files/testConfigs' and therefore the 'target/test-files/testConfigs/ {test-name} /indexing/resources/rdfdata' folder should be empty on your machine. If this is the case than I would the test fail with exactly the message as in the attached surefire-report. I had already a look at the source and I found some potential problems with the initialization of the default configuration on Windows (related with the use of '\' when loading resources from JAR files). However I do not think that this is the cause for your problem as the failing tests do provide their own configuration and do not need this feature. With revision 1450067 I committed those changes and I also improved logging for the unit tests. So please svn up and than go to ' {trunk} /entityhub/indexing/source/jenatdb' and run mvn clean install If the test still fails please attach the command line loggings to this issue (on linux I would use 'mvn clean install > jenatdb-build.log' to generate this file). thx for all your help best Rupert
          Hide
          Oak Ninja added a comment - - edited

          Hi Rupert!

          Sorry it took so long but i thought i'd test building in a linux environment too so i set up a Centos 6.3 machine running Maven 3.0.4 and Java 1.6_41.

          Got the exact same error on both machines. I have attached corresponding logs both from windows8 and centos to this issue. Link here: https://issues.apache.org/jira/secure/attachment/12570981/surefire_reportsR1450112_win8_centos6.3.zip

          Kind regards
          Esse

          EDIT: I'll also run mvn clean install for just jenatdb with logging when i get home.

          Show
          Oak Ninja added a comment - - edited Hi Rupert! Sorry it took so long but i thought i'd test building in a linux environment too so i set up a Centos 6.3 machine running Maven 3.0.4 and Java 1.6_41. Got the exact same error on both machines. I have attached corresponding logs both from windows8 and centos to this issue. Link here: https://issues.apache.org/jira/secure/attachment/12570981/surefire_reportsR1450112_win8_centos6.3.zip Kind regards Esse EDIT: I'll also run mvn clean install for just jenatdb with logging when i get home.
          Hide
          Oak Ninja added a comment -

          Update: Just updated from repository and got a successful build on Centos - i'll try on my Windows 8 VM and report back.

          Show
          Oak Ninja added a comment - Update: Just updated from repository and got a successful build on Centos - i'll try on my Windows 8 VM and report back.
          Hide
          Oak Ninja added a comment -

          Still not building on Windows 8. Failing component + output https://issues.apache.org/jira/secure/attachment/12570993/topic_engine-build.log

          Revision 1450191

          Show
          Oak Ninja added a comment - Still not building on Windows 8. Failing component + output https://issues.apache.org/jira/secure/attachment/12570993/topic_engine-build.log Revision 1450191
          Hide
          Rupert Westenthaler added a comment -

          This is now because of STANBOL-811

          Caused by: org.apache.lucene.index.IndexNotFoundException: no segments* file found in org.apache.lucene.store.SimpleFSDirectory@C:\Users\Esse\AppData\Local\Temp\stanbol-evaluation-folder-9016199723602145004.tmp\evaluationclassifierserver\default-topic-model\data\index lockFactory=org.apache.lucene.store.NativeFSLockFactory@1591b4d: files: [_b.fdt, _b.fdx, _b.frq, _b.prx, _b.tis, _b.tvd, _b.tvf, _b.tvx]

          clearly suggests that my patch for STANBOL-811 (revision http://svn.apache.org/r1449609) has not removed all creations of temp files as the path in the exception still suggests that files within the Windows temp folder are missing.

          Show
          Rupert Westenthaler added a comment - This is now because of STANBOL-811 Caused by: org.apache.lucene.index.IndexNotFoundException: no segments* file found in org.apache.lucene.store.SimpleFSDirectory@C:\Users\Esse\AppData\Local\Temp\stanbol-evaluation-folder-9016199723602145004.tmp\evaluationclassifierserver\default-topic-model\data\index lockFactory=org.apache.lucene.store.NativeFSLockFactory@1591b4d: files: [_b.fdt, _b.fdx, _b.frq, _b.prx, _b.tis, _b.tvd, _b.tvf, _b.tvx] clearly suggests that my patch for STANBOL-811 (revision http://svn.apache.org/r1449609 ) has not removed all creations of temp files as the path in the exception still suggests that files within the Windows temp folder are missing.
          Hide
          Oak Ninja added a comment - - edited

          It feels like you stumble in the darkness - I've set up a lab machine with the following specs:

          Windows Server 2012
          Java JDK6 1.6_41
          Maven 3.0.5
          Notepad++
          Firefox
          Tortoise SVN with command line extention

          Checked out stanbol trunk

          Reachable using any RDP Client. http://www.rdesktop.org/ should do the trick.

          If you skype me (OakNinja) or email me (oakninja ''at'' gmail dot com) i'll send you login details. Note that this is a lab environment set up for this purpose so feel free to do anything.

          Kind regards, Esse

          Show
          Oak Ninja added a comment - - edited It feels like you stumble in the darkness - I've set up a lab machine with the following specs: Windows Server 2012 Java JDK6 1.6_41 Maven 3.0.5 Notepad++ Firefox Tortoise SVN with command line extention Checked out stanbol trunk Reachable using any RDP Client. http://www.rdesktop.org/ should do the trick. If you skype me (OakNinja) or email me (oakninja ''at'' gmail dot com) i'll send you login details. Note that this is a lab environment set up for this purpose so feel free to do anything . Kind regards, Esse
          Hide
          Oak Ninja added a comment -

          Build succeeds on Windows platform.

          Show
          Oak Ninja added a comment - Build succeeds on Windows platform.

            People

            • Assignee:
              Unassigned
              Reporter:
              Oak Ninja
            • Votes:
              0 Vote for this issue
              Watchers:
              2 Start watching this issue

              Dates

              • Created:
                Updated:
                Resolved:

                Development