Details

      Description

      -------------------------------------------------------
      T E S T S
      -------------------------------------------------------
      Running eu.iksproject.kres.reasoners.KReSRunReasonerTest
      :::::::::::::::: consistency check true
      :::::::::::::::: consistency check true
      :::::::::::::::: consistency check true
      :::::::::::::::: consistency check true
      Tests run: 5, Failures: 0, Errors: 0, Skipped: 0, Time elapsed: 2.259 sec
      Running eu.iksproject.kres.reasoners.KReSRunSPARQLTest
      Tests run: 4, Failures: 0, Errors: 4, Skipped: 0, Time elapsed: 0.145 sec <<< FAILURE!
      Running eu.iksproject.kres.reasoners.KReSRunRulesTest
      Tests run: 4, Failures: 0, Errors: 4, Skipped: 0, Time elapsed: 0.074 sec <<< FAILURE!

      Results :

      Tests in error:
      testGetSPARQLprefix(eu.iksproject.kres.reasoners.KReSRunSPARQLTest)
      testAddSPARQLprefix(eu.iksproject.kres.reasoners.KReSRunSPARQLTest)
      testRemoveSPARQLprefix(eu.iksproject.kres.reasoners.KReSRunSPARQLTest)
      testRunSPARQL(eu.iksproject.kres.reasoners.KReSRunSPARQLTest)
      testRunRulesReasoner_OWLOntology_1(eu.iksproject.kres.reasoners.KReSRunRulesTest)
      testRunRulesReasoner_0args_1(eu.iksproject.kres.reasoners.KReSRunRulesTest)
      testRunRulesReasoner_OWLOntology_2(eu.iksproject.kres.reasoners.KReSRunRulesTest)
      testRunRulesReasoner_0args_2(eu.iksproject.kres.reasoners.KReSRunRulesTest)

      Tests run: 13, Failures: 0, Errors: 8, Skipped: 0

      [INFO] ------------------------------------------------------------------------
      [ERROR] BUILD FAILURE
      [INFO] ------------------------------------------------------------------------
      [INFO] There are test failures.

        Activity

        Hide
        Concetto Elvio Bonafede added a comment -

        The problem is the same of STANBOL-35. There was a conflict launched when the test methods tried access to classes of slf4j due to library slf4j-log4j version 1.5.6. In fact the slf4j used is of version 1.5.2. Moreover was needed also adding the library slf4j-simple (version 1.5.2) among test libraries.
        These two changes involve only the pom.xml file of the package eu.iksproject.kres.reasoner.

        The changes are:

        <exclusions>
        <exclusion>
        <artifactId>slf4j-log4j12</artifactId>
        <groupId>org.slf4j</groupId>
        </exclusion>
        </exclusions>

        <dependency>
        <groupId>org.slf4j</groupId>
        <artifactId>slf4j-simple</artifactId>
        <version>1.5.2</version>
        <scope>test</scope>
        </dependency>

        Show
        Concetto Elvio Bonafede added a comment - The problem is the same of STANBOL-35 . There was a conflict launched when the test methods tried access to classes of slf4j due to library slf4j-log4j version 1.5.6. In fact the slf4j used is of version 1.5.2. Moreover was needed also adding the library slf4j-simple (version 1.5.2) among test libraries. These two changes involve only the pom.xml file of the package eu.iksproject.kres.reasoner. The changes are: <exclusions> <exclusion> <artifactId>slf4j-log4j12</artifactId> <groupId>org.slf4j</groupId> </exclusion> </exclusions> <dependency> <groupId>org.slf4j</groupId> <artifactId>slf4j-simple</artifactId> <version>1.5.2</version> <scope>test</scope> </dependency>
        Hide
        Fabian Christ added a comment -

        STANBOL-35 seems to be resolved, is this still an open issue?

        Show
        Fabian Christ added a comment - STANBOL-35 seems to be resolved, is this still an open issue?
        Hide
        Concetto Elvio Bonafede added a comment -

        This problem is the same of STANBOL-35. To solve the errors has been excluded slf4j-log4j12 version 1.5.6 and added slf4j-simple version 1.5.2 to the test library.

        Show
        Concetto Elvio Bonafede added a comment - This problem is the same of STANBOL-35 . To solve the errors has been excluded slf4j-log4j12 version 1.5.6 and added slf4j-simple version 1.5.2 to the test library.

          People

          • Assignee:
            Unassigned
            Reporter:
            Rene Kapusta
          • Votes:
            0 Vote for this issue
            Watchers:
            0 Start watching this issue

            Dates

            • Created:
              Updated:
              Resolved:

              Development