Uploaded image for project: 'ServiceMix'
  1. ServiceMix
  2. SM-3229

org.apache.servicemix.itests.ExamplesCXFTest fails

    XMLWordPrintableJSON

    Details

    • Type: Bug
    • Status: Open
    • Priority: Minor
    • Resolution: Unresolved
    • Affects Version/s: 7.0.0
    • Fix Version/s: None
    • Component/s: itests
    • Labels:
      None
    • Environment:

      tried on MacOS and Windows.

      Description

      I tried to build smx7.0.0 from source, however the org.apache.servicemix.itests.ExamplesCXFTest itest fails.

      -------------------------------------------------------
      T E S T S
      -------------------------------------------------------
      Running org.apache.servicemix.itests.BasicDistroTest
      Tests run: 2, Failures: 0, Errors: 0, Skipped: 0, Time elapsed: 62.982 sec - in org.apache.servicemix.itests.BasicDistroTest
      Running org.apache.servicemix.itests.ExamplesCamelTest
      Tests run: 6, Failures: 0, Errors: 0, Skipped: 0, Time elapsed: 150.596 sec - in org.apache.servicemix.itests.ExamplesCamelTest
      Running org.apache.servicemix.itests.ExamplesCXFTest
      Tests run: 8, Failures: 0, Errors: 1, Skipped: 0, Time elapsed: 144.705 sec <<< FAILURE! - in org.apache.servicemix.itests.ExamplesCXFTest
      testExampleCxfWsn(org.apache.servicemix.itests.ExamplesCXFTest) Time elapsed: 41.478 sec <<< ERROR!
      java.util.concurrent.TimeoutException: Timeout waiting for log message containing ### YOU GOT MAIL ####

      at org.apache.servicemix.itests.base.LogCollector.expectContains(LogCollector.java:63)
      at org.apache.servicemix.itests.ExamplesCXFTest.testExampleCxfWsn(ExamplesCXFTest.java:105)

      Running org.apache.servicemix.itests.ExamplesDrools6Test
      Tests run: 7, Failures: 0, Errors: 0, Skipped: 0, Time elapsed: 176.258 sec - in org.apache.servicemix.itests.ExamplesDrools6Test
      Running org.apache.servicemix.itests.ExamplesTest
      Tests run: 2, Failures: 0, Errors: 1, Skipped: 0, Time elapsed: 124.162 sec <<< FAILURE! - in org.apache.servicemix.itests.ExamplesTest
      testActivity(org.apache.servicemix.itests.ExamplesTest) Time elapsed: 47.721 sec <<< ERROR!
      java.util.concurrent.TimeoutException: Timeout waiting for log message containing Processing order
      at org.apache.servicemix.itests.base.LogCollector.expectContains(LogCollector.java:63)
      at org.apache.servicemix.itests.ExamplesTest.testActivity(ExamplesTest.java:41)

      Results :

      Tests in error:
      ExamplesCXFTest.testExampleCxfWsn:105 » Timeout Timeout waiting for log messag...
      ExamplesTest.testActivity:41 » Timeout Timeout waiting for log message contain...

      Tests run: 25, Failures: 0, Errors: 2, Skipped: 0

        Attachments

          Activity

            People

            • Assignee:
              Unassigned
              Reporter:
              twalzer Thomas Walzer
            • Votes:
              0 Vote for this issue
              Watchers:
              1 Start watching this issue

              Dates

              • Created:
                Updated: