Uploaded image for project: 'ServiceMix'
  1. ServiceMix
  2. SM-2403

Upgrade to maven-surefire-plugin 2.18

    XMLWordPrintableJSON

Details

    Description

      After upgrade to 2.17 done by SM-2399 the itests ended with following error

      [ERROR] Failed to execute goal org.apache.maven.plugins:maven-surefire-plugin:2.17:test (default-test) on project itests: Execution default-test of goal org.apache.maven.plugins:maven-surefire-plugin:2.17:test failed: java.lang.RuntimeException: java.io.IOException: Stream Closed -> [Help 1]
      

      Upgrade to 2.18 solves this problem

      Attachments

        Activity

          People

            sobkowiak Krzysztof Sobkowiak
            sobkowiak Krzysztof Sobkowiak
            Votes:
            0 Vote for this issue
            Watchers:
            1 Start watching this issue

            Dates

              Created:
              Updated:
              Resolved: