Uploaded image for project: 'Sling'
  1. Sling
  2. SLING-9892

adapter-annotations integration tests sometimes fail

    XMLWordPrintableJSON

    Details

      Description

      I have marked two such failing builds at https://ci-builds.apache.org/job/Sling/job/modules/job/sling-org-apache-sling-adapter-annotations/job/master/ as "keep forever", the error is apparently always

      [INFO] [ERROR] Tests run: 1, Failures: 0, Errors: 1, Skipped: 0, Time elapsed: 11.235 s <<< FAILURE! - in org.apache.sling.adapter.annotations.AdapterRegistrationIT
      [INFO] [ERROR] org.apache.sling.adapter.annotations.AdapterRegistrationIT  Time elapsed: 11.21 s  <<< ERROR!
      [INFO] java.lang.RuntimeException: Could not read content from response
      [INFO] 	at org.apache.sling.adapter.annotations.AdapterRegistrationIT.setUpAdaptions(AdapterRegistrationIT.java:58)
      [INFO] Caused by: org.apache.http.MalformedChunkCodingException: CRLF expected at end of chunk
      [INFO] 	at org.apache.sling.adapter.annotations.AdapterRegistrationIT.setUpAdaptions(AdapterRegistrationIT.java:58)
      [INFO] 
      

        Attachments

          Issue Links

            Activity

              People

              • Assignee:
                bdelacretaz Bertrand Delacretaz
                Reporter:
                bdelacretaz Bertrand Delacretaz
              • Votes:
                0 Vote for this issue
                Watchers:
                1 Start watching this issue

                Dates

                • Created:
                  Updated:
                  Resolved: