Uploaded image for project: 'Sling'
  1. Sling
  2. SLING-8300

SlingDefaultValuesTest broken by SLING-2534

    XMLWordPrintableJSON

    Details

      Description

      o.a.s.servlets.post 2.3.28 breaks one of the launchpad iTs:

      [ERROR] Failures: 
      [ERROR]   SlingDefaultValuesTest.testDefaultBehaviour:50->HttpTestBase.assertJavascript:540->HttpTestBase.assertJavascript:547 Expected 'undefined' but got '' for script='out.println("" + data.a)'' and data='{"jcr:primaryType":"nt:unstructured","a":""}'
      [INFO] 
      [ERROR] Tests run: 660, Failures: 1, Errors: 0, Skipped: 1
      

        Attachments

          Activity

            People

            • Assignee:
              rombert Robert Munteanu
              Reporter:
              rombert Robert Munteanu
            • Votes:
              0 Vote for this issue
              Watchers:
              2 Start watching this issue

              Dates

              • Created:
                Updated:
                Resolved: