Uploaded image for project: 'Apache ServiceComb'
  1. Apache ServiceComb
  2. SCB-584

DubboConsumerFilterTest fails on linux

Agile BoardAttach filesAttach ScreenshotVotersStop watchingWatchersCreate sub-taskLinkCloneUpdate Comment AuthorReplace String in CommentUpdate Comment VisibilityDelete Comments
    XMLWordPrintableJSON

Details

    • Bug
    • Status: Resolved
    • Minor
    • Resolution: Fixed
    • saga-0.2.0
    • saga-0.2.0
    • Saga
    • None

    Description

      The DubboConsumerFilterTest fails with the following error:

      -------------------------------------------------------
      T E S T S
      -------------------------------------------------------
      Running SagaDubboProviderFilterTest
      Tests run: 2, Failures: 0, Errors: 0, Skipped: 0, Time elapsed: 0.518 sec - in SagaDubboProviderFilterTest
      Running SagaDubboConsumerFilterTest
      Tests run: 2, Failures: 1, Errors: 0, Skipped: 0, Time elapsed: 0.017 sec <<< FAILURE! - in SagaDubboConsumerFilterTest
      interceptTransactionIdInHeaderIfContextPresent(SagaDubboConsumerFilterTest) Time elapsed: 0.005 sec <<< FAILURE!
      java.lang.AssertionError:

      Expected: is "cf4a9f4a-b9e5-43f5-a7d9-837fa96ee4c0"
      but: was "3ef495de-2f2a-4afa-b991-237cd8de7e1e"
      at SagaDubboConsumerFilterTest.interceptTransactionIdInHeaderIfContextPresent(SagaDubboConsumerFilterTest.java:82)

       

       

       

      Attachments

        Activity

          This comment will be Viewable by All Users Viewable by All Users
          Cancel

          People

            njiang Willem Jiang
            yangbor Yang Bo
            Votes:
            0 Vote for this issue
            Watchers:
            3 Stop watching this issue

            Dates

              Created:
              Updated:
              Resolved:

              Slack

                Issue deployment