Uploaded image for project: 'Qpid'
  1. Qpid
  2. QPID-4770

Perl bindings don't build from qpid-0.22-rc2.tar.gz

    XMLWordPrintableJSON

    Details

    • Type: Bug
    • Status: Open
    • Priority: Major
    • Resolution: Unresolved
    • Affects Version/s: 0.22
    • Fix Version/s: None
    • Component/s: Perl Client
    • Labels:
      None
    • Environment:

      RHEL6

      Description

      Fresh RHEL6 VM:

      ./configure --prefix=/usr

      ...

      gcc -c -D_REENTRANT -D_GNU_SOURCE -fno-strict-aliasing -pipe -fstack-protector -I/usr/local/include -D_LARGEFILE_SOURCE -D_FILE_OFFSET_BITS=64 -g -O2 -DVERSION=\"\" -DXS_VERSION=\"\" -fPIC "-I/usr/lib64/perl5/CORE" cqpid_perl.cpp
      cqpid_perl.cpp:1577:39: error: qpid/messaging/exceptions.h: No such file or directory
      cqpid_perl.cpp:1578:36: error: qpid/messaging/Address.h: No such file or directory
      cqpid_perl.cpp:1579:39: error: qpid/messaging/Connection.h: No such file or directory
      cqpid_perl.cpp:1580:36: error: qpid/messaging/Session.h: No such file or directory
      cqpid_perl.cpp:1581:37: error: qpid/messaging/Receiver.h: No such file or directory
      cqpid_perl.cpp:1582:35: error: qpid/messaging/Sender.h: No such file or directory
      cqpid_perl.cpp:1583:36: error: qpid/messaging/Message.h: No such file or directory
      cqpid_perl.cpp:1584:37: error: qpid/messaging/Duration.h: No such file or directory
      cqpid_perl.cpp:1585:44: error: qpid/messaging/FailoverUpdates.h: No such file or directory
      cqpid_perl.cpp:1591: error: ‘qpid’ has not been declared
      cqpid_perl.cpp:1591: error: expected constructor, destructor, or type conversion before ‘&’ token
      cqpid_perl.cpp:1598: error: ‘qpid’ has not been declared
      cqpid_perl.cpp:1598: error: expected constructor, destructor, or type conversion before ‘&’ token
      cqpid_perl.cpp:1714: error: ‘qpid’ has not been declared
      cqpid_perl.cpp:1714: error: expected initializer before ‘qpid_messaging_Duration__mul_’
      cqpid_perl.cpp:1856: error: ‘qpid’ has not been declared
      cqpid_perl.cpp:1856: error: ‘self’ was not declared in this scope
      cqpid_perl.cpp:1856: error: expected ‘,’ or ‘;’ before ‘

      {’ token cqpid_perl.cpp: In function ‘int _wrap_Duration_FOREVER_get(PerlInterpreter*, SV*, MAGIC*)’: cqpid_perl.cpp:1883: error: ‘qpid’ has not been declared cqpid_perl.cpp: In function ‘int _wrap_Duration_IMMEDIATE_get(PerlInterpreter*, SV*, MAGIC*)’: cqpid_perl.cpp:1890: error: ‘qpid’ has not been declared cqpid_perl.cpp: In function ‘int _wrap_Duration_SECOND_get(PerlInterpreter*, SV*, MAGIC*)’: cqpid_perl.cpp:1897: error: ‘qpid’ has not been declared cqpid_perl.cpp: In function ‘int _wrap_Duration_MINUTE_get(PerlInterpreter*, SV*, MAGIC*)’: cqpid_perl.cpp:1904: error: ‘qpid’ has not been declared cqpid_perl.cpp: At global scope: cqpid_perl.cpp:1926: error: ISO C++ forbids declaration of ‘qpid’ with no type cqpid_perl.cpp:1926: error: expected ‘,’ or ‘...’ before ‘::’ token cqpid_perl.cpp:1927: error: ISO C++ forbids declaration of ‘qpid’ with no type cqpid_perl.cpp:1927: error: expected ‘,’ or ‘...’ before ‘::’ token cqpid_perl.cpp:1928: error: ‘qpid’ has not been declared cqpid_perl.cpp:1928: error: expected ‘,’ or ‘...’ before ‘*’ token cqpid_perl.cpp:1929: error: ‘qpid’ has not been declared cqpid_perl.cpp:1929: error: expected ‘,’ or ‘...’ before ‘*’ token cqpid_perl.cpp:1931: error: ‘qpid’ has not been declared cqpid_perl.cpp:1931: error: expected constructor, destructor, or type conversion before ‘PerlToVariant’ cqpid_perl.cpp:11608: error: expected ‘}

      ’ at end of input
      make[4]: *** [cqpid_perl.o] Error 1

        Attachments

          Activity

            People

            • Assignee:
              Unassigned
              Reporter:
              jimmyjones2 Jimmy Jones
            • Votes:
              0 Vote for this issue
              Watchers:
              1 Start watching this issue

              Dates

              • Created:
                Updated: