Uploaded image for project: 'Phoenix'
  1. Phoenix
  2. PHOENIX-7208

ParallelPhoenixConnectionFailureTest.testExecuteQueryChainFailure still flakey

    XMLWordPrintableJSON

Details

    • Bug
    • Status: Open
    • Critical
    • Resolution: Unresolved
    • 5.2.0
    • None
    • core
    • None

    Description

      This mostly happens when the host is slow and/or the load is high.

      I can sometimes trigger this on my Alder Lake i7 by running 20 UT threads:

      `mvn clean verify -am -pl phoenix-core -DnumForkedUT=20`

      [ERROR] Tests run: 1, Failures: 1, Errors: 0, Skipped: 0, Time elapsed: 6.782 s <<< FAILURE! -- in org.apache.phoenix.jdbc.ParallelPhoenixConnectionFailureTest
      [ERROR] org.apache.phoenix.jdbc.ParallelPhoenixConnectionFailureTest.testExecuteQueryChainFailure -- Time elapsed: 6.769 s <<< FAILURE!
      java.lang.AssertionError
      	at org.junit.Assert.fail(Assert.java:87)
      	at org.junit.Assert.assertTrue(Assert.java:42)
      	at org.junit.Assert.assertTrue(Assert.java:53)
      	at org.apache.phoenix.jdbc.ParallelPhoenixConnectionFailureTest.testExecuteQueryChainFailure(ParallelPhoenixConnectionFailureTest.java:94)
      	at java.base/jdk.internal.reflect.NativeMethodAccessorImpl.invoke0(Native Method)
      	at java.base/jdk.internal.reflect.NativeMethodAccessorImpl.invoke(NativeMethodAccessorImpl.java:62)
      	at java.base/jdk.internal.reflect.DelegatingMethodAccessorImpl.invoke(DelegatingMethodAccessorImpl.java:43)
      	at java.base/java.lang.reflect.Method.invoke(Method.java:566)
      	at org.junit.runners.model.FrameworkMethod$1.runReflectiveCall(FrameworkMethod.java:59)
      	at org.junit.internal.runners.model.ReflectiveCallable.run(ReflectiveCallable.java:12)
      	at org.junit.runners.model.FrameworkMethod.invokeExplosively(FrameworkMethod.java:56)
      	at org.junit.internal.runners.statements.InvokeMethod.evaluate(InvokeMethod.java:17)
      	at org.junit.runners.ParentRunner$3.evaluate(ParentRunner.java:306)
      	at org.junit.runners.BlockJUnit4ClassRunner$1.evaluate(BlockJUnit4ClassRunner.java:100)
      	at org.junit.runners.ParentRunner.runLeaf(ParentRunner.java:366)
      	at org.junit.runners.BlockJUnit4ClassRunner.runChild(BlockJUnit4ClassRunner.java:103)
      	at org.junit.runners.BlockJUnit4ClassRunner.runChild(BlockJUnit4ClassRunner.java:63)
      	at org.junit.runners.ParentRunner$4.run(ParentRunner.java:331)
      	at org.junit.runners.ParentRunner$1.schedule(ParentRunner.java:79)
      	at org.junit.runners.ParentRunner.runChildren(ParentRunner.java:329)
      	at org.junit.runners.ParentRunner.access$100(ParentRunner.java:66)
      	at org.junit.runners.ParentRunner$2.evaluate(ParentRunner.java:293)
      	at org.apache.phoenix.SystemExitRule$1.evaluate(SystemExitRule.java:40)
      	at org.junit.rules.ExternalResource$1.evaluate(ExternalResource.java:54)
      	at org.junit.rules.RunRules.evaluate(RunRules.java:20)
      	at org.junit.runners.ParentRunner$3.evaluate(ParentRunner.java:306)
      	at org.junit.runners.ParentRunner.run(ParentRunner.java:413)
      	at org.apache.maven.surefire.junit4.JUnit4Provider.execute(JUnit4Provider.java:316)
      	at org.apache.maven.surefire.junit4.JUnit4Provider.executeWithRerun(JUnit4Provider.java:240)
      	at org.apache.maven.surefire.junit4.JUnit4Provider.executeTestSet(JUnit4Provider.java:214)
      	at org.apache.maven.surefire.junit4.JUnit4Provider.invoke(JUnit4Provider.java:155)
      	at org.apache.maven.surefire.booter.ForkedBooter.runSuitesInProcess(ForkedBooter.java:385)
      	at org.apache.maven.surefire.booter.ForkedBooter.execute(ForkedBooter.java:162)
      	at org.apache.maven.surefire.booter.ForkedBooter.run(ForkedBooter.java:507)
      	at org.apache.maven.surefire.booter.ForkedBooter.main(ForkedBooter.java:495)
      
      

      Attachments

        Issue Links

          Activity

            People

              Unassigned Unassigned
              stoty Istvan Toth
              Votes:
              0 Vote for this issue
              Watchers:
              1 Start watching this issue

              Dates

                Created:
                Updated: