Uploaded image for project: 'Phoenix'
  1. Phoenix
  2. PHOENIX-4269

IndexScrutinyToolIT is flapping

Attach filesAttach ScreenshotVotersWatch issueWatchersCreate sub-taskLinkCloneUpdate Comment AuthorReplace String in CommentUpdate Comment VisibilityDelete Comments
    XMLWordPrintableJSON

Details

    • Bug
    • Status: Resolved
    • Major
    • Resolution: Fixed
    • 4.13.0
    • 4.13.0
    • None
    • None

    Description

      In a local test run (not able to repro when run separately), I saw the following failure:

      [ERROR] Tests run: 20, Failures: 1, Errors: 0, Skipped: 0, Time elapsed: 193.228 s <<< FAILURE! - in org.apache.phoenix.end2end.IndexScrutinyToolIT
      [ERROR] testBothDataAndIndexAsSource[0](org.apache.phoenix.end2end.IndexScrutinyToolIT)  Time elapsed: 11.708 s  <<< FAILURE!
      java.lang.AssertionError: expected:<1> but was:<0>
      	at org.apache.phoenix.end2end.IndexScrutinyToolIT.testBothDataAndIndexAsSource(IndexScrutinyToolIT.java:344)
      

      Attachments

        Activity

          This comment will be Viewable by All Users Viewable by All Users
          Cancel

          People

            vincentpoon Vincent Poon
            jamestaylor James R. Taylor
            Votes:
            0 Vote for this issue
            Watchers:
            5 Start watching this issue

            Dates

              Created:
              Updated:
              Resolved:

              Slack

                Issue deployment