Uploaded image for project: 'Phoenix'
  1. Phoenix
  2. PHOENIX-2962

Compilation issue on 4.x-HBase-1.1

    XMLWordPrintableJSON

Details

    • Bug
    • Status: Closed
    • Blocker
    • Resolution: Fixed
    • None
    • 4.8.0
    • None
    • None

    Description

      From https://builds.apache.org/job/Phoenix-4.x-HBase-1.1/33/console

      [INFO] -------------------------------------------------------------
      [ERROR] COMPILATION ERROR : 
      [INFO] -------------------------------------------------------------
      [ERROR] /home/jenkins/jenkins-slave/workspace/Phoenix-4.x-HBase-1.1/phoenix-core/src/main/java/org/apache/phoenix/util/DateUtil.java:[35,42] cannot find symbol
        symbol:   class IllegalArgumentIOException
        location: package org.apache.hadoop.hbase.exceptions
      [INFO] 1 error
      [INFO] -------------------------------------------------------------
      [INFO] ------------------------------------------------------------------------
      [INFO] Reactor Summary:
      [INFO] 
      [INFO] Apache Phoenix .................................... SUCCESS [4.989s]
      [INFO] Phoenix Core ...................................... FAILURE [34.868s]
      [INFO] Phoenix - Flume ................................... SKIPPED
      [INFO] Phoenix - Pig ..................................... SKIPPED
      [INFO] Phoenix Query Server Client ....................... SKIPPED
      [INFO] Phoenix Query Server .............................. SKIPPED
      [INFO] Phoenix - Pherf ................................... SKIPPED
      [INFO] Phoenix - Spark ................................... SKIPPED
      [INFO] Phoenix - Hive .................................... SKIPPED
      [INFO] Phoenix Assembly .................................. SKIPPED
      [INFO] Phoenix - Tracing Web Application ................. SKIPPED
      [INFO] ------------------------------------------------------------------------
      [INFO] BUILD FAILURE
      [INFO] ------------------------------------------------------------------------
      [INFO] Total time: 40.772s
      [INFO] Finished at: Wed Jun 01 17:54:10 UTC 2016
      [INFO] Final Memory: 60M/1435M
      [INFO] ------------------------------------------------------------------------
      

      Attachments

        Issue Links

          Activity

            People

              elserj Josh Elser
              elserj Josh Elser
              Votes:
              0 Vote for this issue
              Watchers:
              2 Start watching this issue

              Dates

                Created:
                Updated:
                Resolved: