Uploaded image for project: 'Phoenix'
  1. Phoenix
  2. PHOENIX-2573

Pherf IT test fails

    XMLWordPrintableJSON

    Details

    • Type: Bug
    • Status: Resolved
    • Priority: Major
    • Resolution: Fixed
    • Affects Version/s: 4.7.0
    • Fix Version/s: 4.7.0
    • Component/s: None
    • Labels:

      Description

      Tests run: 1, Failures: 1, Errors: 0, Skipped: 0, Time elapsed: 26.119 sec <<< FAILURE! - in org.apache.phoenix.pherf.SchemaReaderIT
      testSchemaReader(org.apache.phoenix.pherf.SchemaReaderIT) Time elapsed: 11.769 sec <<< FAILURE!
      java.lang.AssertionError: Could not retrieve Metadata from Phoenix
      at org.apache.phoenix.pherf.SchemaReaderIT.assertApplySchemaTest(SchemaReaderIT.java:72)
      at org.apache.phoenix.pherf.SchemaReaderIT.testSchemaReader(SchemaReaderIT.java:44)

      Tests run: 4, Failures: 2, Errors: 0, Skipped: 0, Time elapsed: 39.955 sec <<< FAILURE! - in org.apache.phoenix.pherf.DataIngestIT
      testRWWorkload(org.apache.phoenix.pherf.DataIngestIT) Time elapsed: 9.979 sec <<< FAILURE!
      java.lang.AssertionError: Failed to load data. An exception was thrown: org.apache.phoenix.schema.TableNotFoundException: ERROR 1012 (42M03): Table undefined. tableName=PHERF.TEST_TABLE
      at org.apache.phoenix.pherf.DataIngestIT.testRWWorkload(DataIngestIT.java:152)

      testColumnRulesApplied(org.apache.phoenix.pherf.DataIngestIT) Time elapsed: 1.322 sec <<< FAILURE!
      java.lang.AssertionError: Could not get phoenix columns.
      at org.apache.phoenix.pherf.DataIngestIT.testColumnRulesApplied(DataIngestIT.java:73)

      Tests run: 1, Failures: 0, Errors: 0, Skipped: 0, Time elapsed: 50.064 sec - in org.apache.phoenix.pherf.PherfMainIT

      Results :

      Failed tests:
      DataIngestIT.testColumnRulesApplied:73 Could not get phoenix columns.
      DataIngestIT.testRWWorkload:152 Failed to load data. An exception was thrown: org.apache.phoenix.schema.TableNotFoundException: ERROR 1012 (42M03): Table undefined. tableName=PHERF.TEST_TABLE
      SchemaReaderIT.testSchemaReader:44->assertApplySchemaTest:72 Could not retrieve Metadata from Phoenix

      Tests run: 6, Failures: 3, Errors: 0, Skipped: 0

        Attachments

        1. PHOENIX-2573.patch
          5 kB
          Cody Marcel

          Issue Links

            Activity

              People

              • Assignee:
                cody.marcel@gmail.com Cody Marcel
                Reporter:
                cody.marcel@gmail.com Cody Marcel
              • Votes:
                0 Vote for this issue
                Watchers:
                3 Start watching this issue

                Dates

                • Created:
                  Updated:
                  Resolved: