Uploaded image for project: 'Oozie'
  1. Oozie
  2. OOZIE-1619 Enhancing sharelib support
  3. OOZIE-1633

Test failures related to sharelib when running against Hadoop 2

    XMLWordPrintableJSON

    Details

    • Type: Sub-task
    • Status: Closed
    • Priority: Major
    • Resolution: Fixed
    • Affects Version/s: trunk
    • Fix Version/s: 4.1.0
    • Component/s: tests
    • Labels:
      None

      Description

      When run against Hadoop 2, TestJavaActionExecutor has this test failure:

      testAddShareLibSchemeAndAuthority(org.apache.oozie.action.hadoop.TestJavaActionExecutor)  Time elapsed: 0.002 sec  <<< ERROR!
      org.apache.oozie.action.ActionExecutorException: File /user/rkanter/share does not exist.
      	at org.apache.oozie.action.hadoop.JavaActionExecutor.addShareLib(JavaActionExecutor.java:521)
      	at org.apache.oozie.action.hadoop.TestJavaActionExecutor.testAddShareLibSchemeAndAuthority(TestJavaActionExecutor.java:1257)
      	at sun.reflect.NativeMethodAccessorImpl.invoke0(Native Method)
      	at sun.reflect.NativeMethodAccessorImpl.invoke(NativeMethodAccessorImpl.java:39)
      	at sun.reflect.DelegatingMethodAccessorImpl.invoke(DelegatingMethodAccessorImpl.java:25)
      	at java.lang.reflect.Method.invoke(Method.java:597)
      	at junit.framework.TestCase.runTest(TestCase.java:168)
      	at junit.framework.TestCase.runBare(TestCase.java:134)
      	at junit.framework.TestResult$1.protect(TestResult.java:110)
      	at junit.framework.TestResult.runProtected(TestResult.java:128)
      	at junit.framework.TestResult.run(TestResult.java:113)
      	at junit.framework.TestCase.run(TestCase.java:124)
      	at junit.framework.TestSuite.runTest(TestSuite.java:243)
      	at junit.framework.TestSuite.run(TestSuite.java:238)
      	at org.junit.internal.runners.JUnit38ClassRunner.run(JUnit38ClassRunner.java:83)
      	at org.apache.maven.surefire.junitcore.ClassDemarcatingRunner.run(ClassDemarcatingRunner.java:58)
      	at org.junit.runners.Suite.runChild(Suite.java:128)
      	at org.junit.runners.Suite.runChild(Suite.java:24)
      	at org.junit.runners.ParentRunner$3.run(ParentRunner.java:231)
      	at java.util.concurrent.Executors$RunnableAdapter.call(Executors.java:439)
      	at java.util.concurrent.FutureTask$Sync.innerRun(FutureTask.java:303)
      	at java.util.concurrent.FutureTask.run(FutureTask.java:138)
      	at java.util.concurrent.ThreadPoolExecutor$Worker.runTask(ThreadPoolExecutor.java:895)
      	at java.util.concurrent.ThreadPoolExecutor$Worker.run(ThreadPoolExecutor.java:918)
      	at java.lang.Thread.run(Thread.java:695)
      

      And TestShareLibService has these three failures:

      testAddShareLib_pig(org.apache.oozie.service.TestShareLibService)  Time elapsed: 0.004 sec  <<< FAILURE!
      junit.framework.AssertionFailedError: expected:<2> but was:<4>
      	at junit.framework.Assert.fail(Assert.java:50)
      	at junit.framework.Assert.failNotEquals(Assert.java:287)
      	at junit.framework.Assert.assertEquals(Assert.java:67)
      	at junit.framework.Assert.assertEquals(Assert.java:199)
      	at junit.framework.Assert.assertEquals(Assert.java:205)
      	at org.apache.oozie.service.TestShareLibService.testAddShareLib_pig(TestShareLibService.java:176)
      	at sun.reflect.NativeMethodAccessorImpl.invoke0(Native Method)
      	at sun.reflect.NativeMethodAccessorImpl.invoke(NativeMethodAccessorImpl.java:39)
      	at sun.reflect.DelegatingMethodAccessorImpl.invoke(DelegatingMethodAccessorImpl.java:25)
      	at java.lang.reflect.Method.invoke(Method.java:597)
      	at junit.framework.TestCase.runTest(TestCase.java:168)
      	at junit.framework.TestCase.runBare(TestCase.java:134)
      	at junit.framework.TestResult$1.protect(TestResult.java:110)
      	at junit.framework.TestResult.runProtected(TestResult.java:128)
      	at junit.framework.TestResult.run(TestResult.java:113)
      	at junit.framework.TestCase.run(TestCase.java:124)
      	at junit.framework.TestSuite.runTest(TestSuite.java:243)
      	at junit.framework.TestSuite.run(TestSuite.java:238)
      	at org.junit.internal.runners.JUnit38ClassRunner.run(JUnit38ClassRunner.java:83)
      	at org.apache.maven.surefire.junitcore.ClassDemarcatingRunner.run(ClassDemarcatingRunner.java:58)
      	at org.junit.runners.Suite.runChild(Suite.java:128)
      	at org.junit.runners.Suite.runChild(Suite.java:24)
      	at org.junit.runners.ParentRunner$3.run(ParentRunner.java:231)
      	at java.util.concurrent.Executors$RunnableAdapter.call(Executors.java:439)
      	at java.util.concurrent.FutureTask$Sync.innerRun(FutureTask.java:303)
      	at java.util.concurrent.FutureTask.run(FutureTask.java:138)
      	at java.util.concurrent.ThreadPoolExecutor$Worker.runTask(ThreadPoolExecutor.java:895)
      	at java.util.concurrent.ThreadPoolExecutor$Worker.run(ThreadPoolExecutor.java:918)
      	at java.lang.Thread.run(Thread.java:695)
      
      testAddShareLib_pig_withVersion(org.apache.oozie.service.TestShareLibService)  Time elapsed: 0.001 sec  <<< FAILURE!
      junit.framework.AssertionFailedError: expected:<3> but was:<5>
      	at junit.framework.Assert.fail(Assert.java:50)
      	at junit.framework.Assert.failNotEquals(Assert.java:287)
      	at junit.framework.Assert.assertEquals(Assert.java:67)
      	at junit.framework.Assert.assertEquals(Assert.java:199)
      	at junit.framework.Assert.assertEquals(Assert.java:205)
      	at org.apache.oozie.service.TestShareLibService.testAddShareLib_pig_withVersion(TestShareLibService.java:224)
      	at sun.reflect.NativeMethodAccessorImpl.invoke0(Native Method)
      	at sun.reflect.NativeMethodAccessorImpl.invoke(NativeMethodAccessorImpl.java:39)
      	at sun.reflect.DelegatingMethodAccessorImpl.invoke(DelegatingMethodAccessorImpl.java:25)
      	at java.lang.reflect.Method.invoke(Method.java:597)
      	at junit.framework.TestCase.runTest(TestCase.java:168)
      	at junit.framework.TestCase.runBare(TestCase.java:134)
      	at junit.framework.TestResult$1.protect(TestResult.java:110)
      	at junit.framework.TestResult.runProtected(TestResult.java:128)
      	at junit.framework.TestResult.run(TestResult.java:113)
      	at junit.framework.TestCase.run(TestCase.java:124)
      	at junit.framework.TestSuite.runTest(TestSuite.java:243)
      	at junit.framework.TestSuite.run(TestSuite.java:238)
      	at org.junit.internal.runners.JUnit38ClassRunner.run(JUnit38ClassRunner.java:83)
      	at org.apache.maven.surefire.junitcore.ClassDemarcatingRunner.run(ClassDemarcatingRunner.java:58)
      	at org.junit.runners.Suite.runChild(Suite.java:128)
      	at org.junit.runners.Suite.runChild(Suite.java:24)
      	at org.junit.runners.ParentRunner$3.run(ParentRunner.java:231)
      	at java.util.concurrent.Executors$RunnableAdapter.call(Executors.java:439)
      	at java.util.concurrent.FutureTask$Sync.innerRun(FutureTask.java:303)
      	at java.util.concurrent.FutureTask.run(FutureTask.java:138)
      	at java.util.concurrent.ThreadPoolExecutor$Worker.runTask(ThreadPoolExecutor.java:895)
      	at java.util.concurrent.ThreadPoolExecutor$Worker.run(ThreadPoolExecutor.java:918)
      	at java.lang.Thread.run(Thread.java:695)
      
      testLoadfromDFS(org.apache.oozie.service.TestShareLibService)  Time elapsed: 0.002 sec  <<< FAILURE!
      junit.framework.AssertionFailedError: expected:<2> but was:<4>
      	at junit.framework.Assert.fail(Assert.java:50)
      	at junit.framework.Assert.failNotEquals(Assert.java:287)
      	at junit.framework.Assert.assertEquals(Assert.java:67)
      	at junit.framework.Assert.assertEquals(Assert.java:199)
      	at junit.framework.Assert.assertEquals(Assert.java:205)
      	at org.apache.oozie.service.TestShareLibService.testLoadfromDFS(TestShareLibService.java:421)
      	at sun.reflect.NativeMethodAccessorImpl.invoke0(Native Method)
      	at sun.reflect.NativeMethodAccessorImpl.invoke(NativeMethodAccessorImpl.java:39)
      	at sun.reflect.DelegatingMethodAccessorImpl.invoke(DelegatingMethodAccessorImpl.java:25)
      	at java.lang.reflect.Method.invoke(Method.java:597)
      	at junit.framework.TestCase.runTest(TestCase.java:168)
      	at junit.framework.TestCase.runBare(TestCase.java:134)
      	at junit.framework.TestResult$1.protect(TestResult.java:110)
      	at junit.framework.TestResult.runProtected(TestResult.java:128)
      	at junit.framework.TestResult.run(TestResult.java:113)
      	at junit.framework.TestCase.run(TestCase.java:124)
      	at junit.framework.TestSuite.runTest(TestSuite.java:243)
      	at junit.framework.TestSuite.run(TestSuite.java:238)
      	at org.junit.internal.runners.JUnit38ClassRunner.run(JUnit38ClassRunner.java:83)
      	at org.apache.maven.surefire.junitcore.ClassDemarcatingRunner.run(ClassDemarcatingRunner.java:58)
      	at org.junit.runners.Suite.runChild(Suite.java:128)
      	at org.junit.runners.Suite.runChild(Suite.java:24)
      	at org.junit.runners.ParentRunner$3.run(ParentRunner.java:231)
      	at java.util.concurrent.Executors$RunnableAdapter.call(Executors.java:439)
      	at java.util.concurrent.FutureTask$Sync.innerRun(FutureTask.java:303)
      	at java.util.concurrent.FutureTask.run(FutureTask.java:138)
      	at java.util.concurrent.ThreadPoolExecutor$Worker.runTask(ThreadPoolExecutor.java:895)
      	at java.util.concurrent.ThreadPoolExecutor$Worker.run(ThreadPoolExecutor.java:918)
      	at java.lang.Thread.run(Thread.java:695)
      

        Attachments

        1. OOZIE-1633.patch
          6 kB
          Robert Kanter

          Activity

            People

            • Assignee:
              rkanter Robert Kanter
              Reporter:
              rkanter Robert Kanter
            • Votes:
              0 Vote for this issue
              Watchers:
              2 Start watching this issue

              Dates

              • Created:
                Updated:
                Resolved: