Details

    • Type: Sub-task Sub-task
    • Status: Open
    • Priority: Major Major
    • Resolution: Unresolved
    • Affects Version/s: 2.0-beta2
    • Fix Version/s: 2.0-beta3
    • Component/s: Build System
    • Labels:
      None

      Description

      Three test cases failed in the bpel-tests module, they are in MessageRouting20Test.java, VersionedRedeployTest.java, StructuredActivities20Test.java I've excluded them in the bpel-test/pom.xml for now.

      -------------------------------------------------------------------------------
      Test set: org.apache.ode.test.VersionedRedeployTest
      -------------------------------------------------------------------------------
      Tests run: 3, Failures: 1, Errors: 0, Skipped: 0, Time elapsed: 11.07 sec <<< FAILURE!
      testRetireOld(org.apache.ode.test.VersionedRedeployTest) Time elapsed: 0.295 sec <<< FAILURE!
      java.lang.AssertionError: expected:<RETIRED> but was:<ACTIVE>
      at org.junit.Assert.fail(Assert.java:74)
      at org.junit.Assert.failNotEquals(Assert.java:448)
      at org.junit.Assert.assertEquals(Assert.java:102)
      at org.junit.Assert.assertEquals(Assert.java:117)
      at org.apache.ode.test.VersionedRedeployTest.testRetireOld(VersionedRedeployTest.java:47)
      at sun.reflect.NativeMethodAccessorImpl.invoke0(Native Method)
      at sun.reflect.NativeMethodAccessorImpl.invoke(NativeMethodAccessorImpl.java:39)
      at sun.reflect.DelegatingMethodAccessorImpl.invoke(DelegatingMethodAccessorImpl.java:25)
      at java.lang.reflect.Method.invoke(Method.java:585)
      at org.junit.internal.runners.TestMethod.invoke(TestMethod.java:59)
      at org.junit.internal.runners.MethodRoadie.runTestMethod(MethodRoadie.java:98)
      at org.junit.internal.runners.MethodRoadie$2.run(MethodRoadie.java:79)
      at org.junit.internal.runners.MethodRoadie.runBeforesThenTestThenAfters(MethodRoadie.java:87)
      at org.junit.internal.runners.MethodRoadie.runTest(MethodRoadie.java:77)
      at org.junit.internal.runners.MethodRoadie.run(MethodRoadie.java:42)
      at org.junit.internal.runners.JUnit4ClassRunner.invokeTestMethod(JUnit4ClassRunner.java:88)
      at org.junit.internal.runners.JUnit4ClassRunner.runMethods(JUnit4ClassRunner.java:51)
      at org.junit.internal.runners.JUnit4ClassRunner$1.run(JUnit4ClassRunner.java:44)
      at org.junit.internal.runners.ClassRoadie.runUnprotected(ClassRoadie.java:27)
      at org.junit.internal.runners.ClassRoadie.runProtected(ClassRoadie.java:37)
      at org.junit.internal.runners.JUnit4ClassRunner.run(JUnit4ClassRunner.java:42)
      at org.apache.maven.surefire.junit4.JUnit4TestSet.execute(JUnit4TestSet.java:62)
      at org.apache.maven.surefire.suite.AbstractDirectoryTestSuite.executeTestSet(AbstractDirectoryTestSuite.java:140)
      at org.apache.maven.surefire.suite.AbstractDirectoryTestSuite.execute(AbstractDirectoryTestSuite.java:127)
      at org.apache.maven.surefire.Surefire.run(Surefire.java:177)
      at sun.reflect.NativeMethodAccessorImpl.invoke0(Native Method)
      at sun.reflect.NativeMethodAccessorImpl.invoke(NativeMethodAccessorImpl.java:39)
      at sun.reflect.DelegatingMethodAccessorImpl.invoke(DelegatingMethodAccessorImpl.java:25)
      at java.lang.reflect.Method.invoke(Method.java:585)
      at org.apache.maven.surefire.booter.SurefireBooter.runSuitesInProcess(SurefireBooter.java:345)
      at org.apache.maven.surefire.booter.SurefireBooter.main(SurefireBooter.java:1009)

      -------------------------------------------------------------------------------
      Test set: org.apache.ode.test.MessageRouting20Test
      -------------------------------------------------------------------------------
      Tests run: 11, Failures: 1, Errors: 0, Skipped: 3, Time elapsed: 119.635 sec <<< FAILURE!
      testIMA(org.apache.ode.test.MessageRouting20Test) Time elapsed: 66.239 sec <<< FAILURE!
      java.lang.AssertionError: Failure report:
      Invocation#/local/works/ode-2.0-maven/bpel-test/target/test-classes/bpel/2.0/TestIMA/test1.properties#1: Unexpected invocation exception.; got exception:
      java.util.concurrent.TimeoutException
      at org.apache.ode.bpel.engine.MessageExchangeImpl$ResponseFuture.get(MessageExchangeImpl.java:441)
      at org.apache.ode.bpel.engine.MessageExchangeImpl$ResponseFuture.get(MessageExchangeImpl.java:418)
      at org.apache.ode.bpel.engine.UnreliableMyRoleMessageExchangeImpl.invokeBlocking(UnreliableMyRoleMessageExchangeImpl.java:68)
      at org.apache.ode.test.BPELTestAbstract$InvokerThread.run2(BPELTestAbstract.java:624)
      at org.apache.ode.test.BPELTestAbstract$InvokerThread.run(BPELTestAbstract.java:584)

      Invocation#/local/works/ode-2.0-maven/bpel-test/target/test-classes/bpel/2.0/TestIMA/test3.properties#1: Unexpected invocation exception.; got exception:
      java.util.concurrent.TimeoutException
      at org.apache.ode.bpel.engine.MessageExchangeImpl$ResponseFuture.get(MessageExchangeImpl.java:441)
      at org.apache.ode.bpel.engine.MessageExchangeImpl$ResponseFuture.get(MessageExchangeImpl.java:418)
      at org.apache.ode.bpel.engine.UnreliableMyRoleMessageExchangeImpl.invokeBlocking(UnreliableMyRoleMessageExchangeImpl.java:68)
      at org.apache.ode.test.BPELTestAbstract$InvokerThread.run2(BPELTestAbstract.java:624)
      at org.apache.ode.test.BPELTestAbstract$InvokerThread.run(BPELTestAbstract.java:584)

      Invocation#/local/works/ode-2.0-maven/bpel-test/target/test-classes/bpel/2.0/TestIMA/test4.properties#1: Unexpected invocation exception.; got exception:
      java.util.concurrent.TimeoutException
      at org.apache.ode.bpel.engine.MessageExchangeImpl$ResponseFuture.get(MessageExchangeImpl.java:441)
      at org.apache.ode.bpel.engine.MessageExchangeImpl$ResponseFuture.get(MessageExchangeImpl.java:418)
      at org.apache.ode.bpel.engine.UnreliableMyRoleMessageExchangeImpl.invokeBlocking(UnreliableMyRoleMessageExchangeImpl.java:68)
      at org.apache.ode.test.BPELTestAbstract$InvokerThread.run2(BPELTestAbstract.java:624)
      at org.apache.ode.test.BPELTestAbstract$InvokerThread.run(BPELTestAbstract.java:584)

      -------------------------------------------------------------------------------
      Test set: org.apache.ode.test.StructuredActivities20Test
      -------------------------------------------------------------------------------
      Tests run: 6, Failures: 1, Errors: 0, Skipped: 3, Time elapsed: 48.877 sec <<< FAILURE!
      testIsolatedScopes1(org.apache.ode.test.StructuredActivities20Test) Time elapsed: 40.501 sec <<< FAILURE!
      java.lang.AssertionError: Failure report:
      Invocation#/local/works/ode-2.0-maven/bpel-test/target/test-classes/bpel/2.0/TestIsolatedScopes1/test.properties#6: Unexpected invocation exception.; got exception:
      java.util.concurrent.TimeoutException
      at org.apache.ode.bpel.engine.MessageExchangeImpl$ResponseFuture.get(MessageExchangeImpl.java:441)
      at org.apache.ode.bpel.engine.MessageExchangeImpl$ResponseFuture.get(MessageExchangeImpl.java:418)
      at org.apache.ode.bpel.engine.UnreliableMyRoleMessageExchangeImpl.invokeBlocking(UnreliableMyRoleMessageExchangeImpl.java:68)
      at org.apache.ode.test.BPELTestAbstract$InvokerThread.run2(BPELTestAbstract.java:624)
      at org.apache.ode.test.BPELTestAbstract$InvokerThread.run(BPELTestAbstract.java:584)

        Activity

          People

          • Assignee:
            Unassigned
            Reporter:
            Jeff Yu
          • Votes:
            0 Vote for this issue
            Watchers:
            0 Start watching this issue

            Dates

            • Created:
              Updated:

              Development