Uploaded image for project: 'Jackrabbit Oak'
  1. Jackrabbit Oak
  2. OAK-8768

failed TokenCleanupTest.testExpiredReachingThreshold

    XMLWordPrintableJSON

    Details

    • Type: Bug
    • Status: Resolved
    • Priority: Minor
    • Resolution: Cannot Reproduce
    • Affects Version/s: 1.18.0
    • Fix Version/s: None
    • Component/s: core
    • Labels:
      None

      Description

      The following test failure was encountered in one of the oak-core test runs (potential surefire details not available unfortunately) at rev 1869782:

      mvn -B verify -Prelease -Dtest.opts.memory=-Xmx2048m
      
      [...]
      
      [INFO] Running org.apache.jackrabbit.oak.security.authentication.token.TokenCleanupTest
      [ERROR] Tests run: 3, Failures: 1, Errors: 0, Skipped: 0, Time elapsed: 0.342 s <<< FAILURE! - in org.apache.jackrabbit.oak.security.authentication.token.TokenCleanupTest
      [ERROR] testExpiredReachingThreshold(org.apache.jackrabbit.oak.security.authentication.token.TokenCleanupTest)  Time elapsed: 0.182 s  <<< FAILURE!
      java.lang.AssertionError: expected:<50> but was:<54>
      	at org.apache.jackrabbit.oak.security.authentication.token.TokenCleanupTest.assertTokenNodes(TokenCleanupTest.java:48)
      	at org.apache.jackrabbit.oak.security.authentication.token.TokenCleanupTest.testExpiredReachingThreshold(TokenCleanupTest.java:83)
      

        Attachments

          Issue Links

            Activity

              People

              • Assignee:
                Unassigned
                Reporter:
                stefanegli Stefan Egli
              • Votes:
                0 Vote for this issue
                Watchers:
                1 Start watching this issue

                Dates

                • Created:
                  Updated:
                  Resolved: