Uploaded image for project: 'Jackrabbit Oak'
  1. Jackrabbit Oak
  2. OAK-6975

test failure seen in org.apache.jackrabbit.oak.segment.upgrade.UpgradeIT

    XMLWordPrintableJSON

    Details

      Description

      INFO] Running org.apache.jackrabbit.oak.segment.upgrade.UpgradeIT
      [WARNING] Corrupted STDOUT by directly writing to native stream in forked JVM 1. See FAQ web page and the dump file C:\projects\apache\oak\trunk\oak-segment-tar\target\failsafe-reports\2017-11-23T08-48-55_999-jvmRun1.dumpstream
      [ERROR] Tests run: 4, Failures: 1, Errors: 0, Skipped: 0, Time elapsed: 17.984 s <<< FAILURE! - in org.apache.jackrabbit.oak.segment.upgrade.UpgradeIT
      [ERROR] offRCUpgradesSegments(org.apache.jackrabbit.oak.segment.upgrade.UpgradeIT)  Time elapsed: 5.024 s  <<< FAILURE!
      java.lang.AssertionError: Segment version mismatch. Expected V_13, found V_12 expected:<V_13> but was:<V_12>
              at org.apache.jackrabbit.oak.segment.upgrade.UpgradeIT.checkSegmentVersion(UpgradeIT.java:143)
              at org.apache.jackrabbit.oak.segment.upgrade.UpgradeIT.offRCUpgradesSegments(UpgradeIT.java:108)
      
      

        Attachments

          Issue Links

            Activity

              People

              • Assignee:
                frm Francesco Mari
                Reporter:
                reschke Julian Reschke
              • Votes:
                0 Vote for this issue
                Watchers:
                2 Start watching this issue

                Dates

                • Created:
                  Updated:
                  Resolved: