Uploaded image for project: 'Jackrabbit Oak'
  1. Jackrabbit Oak
  2. OAK-6367

Build Jackrabbit Oak #426 failed

    XMLWordPrintableJSON

    Details

    • Type: Bug
    • Status: Closed
    • Priority: Major
    • Resolution: Duplicate
    • Affects Version/s: None
    • Fix Version/s: None
    • Component/s: continuous integration
    • Labels:
      None

      Description

      Jenkins CI failure: https://builds.apache.org/view/J/job/Jackrabbit%20Oak/

      The build Jackrabbit Oak #426 has failed.
      First failed run: Jackrabbit Oak #426 console log

      [INFO] Running org.apache.jackrabbit.oak.upgrade.cli.JdbcToSegmentTest
      [ERROR] Tests run: 1, Failures: 0, Errors: 1, Skipped: 0, Time elapsed: 3.788 s <<< FAILURE! - in org.apache.jackrabbit.oak.upgrade.cli.JdbcToSegmentTest
      [ERROR] validateMigration(org.apache.jackrabbit.oak.upgrade.cli.JdbcToSegmentTest)  Time elapsed: 3.788 s  <<< ERROR!
      javax.jcr.RepositoryException: Failed to copy content
      Caused by: java.lang.IllegalStateException: Branch with failed reset
      Caused by: org.apache.jackrabbit.oak.api.CommitFailedException: OakOak0100: Branch reset failed
      Caused by: org.apache.jackrabbit.oak.plugins.document.DocumentStoreException: Empty branch cannot be reset
      

        Attachments

          Issue Links

            Activity

              People

              • Assignee:
                Unassigned
                Reporter:
                hudson Hudson
              • Votes:
                0 Vote for this issue
                Watchers:
                1 Start watching this issue

                Dates

                • Created:
                  Updated:
                  Resolved: