Uploaded image for project: 'Jackrabbit Oak'
  1. Jackrabbit Oak
  2. OAK-6274

Test failure: Test failure: ExternalPrivateStoreIT.testProxyFlippedIntermediateByte

    XMLWordPrintableJSON

    Details

      Description

      Jenkins CI failure: https://builds.apache.org/view/J/job/Jackrabbit%20Oak/

      The build Jackrabbit Oak #355 has failed.
      First failed run: Jackrabbit Oak #355 console log

      Regression
      
      org.apache.jackrabbit.oak.segment.standby.ExternalPrivateStoreIT.testProxyFlippedIntermediateByteChange
      Failing for the past 1 build (Since Failed#355 )
      Took 3.5 sec.
      add description
      Error Message
      
      expected:<{ root = { ... } }> but was:<{ root : { } }>
      
      Stacktrace
      
      java.lang.AssertionError: expected:<{ root = { ... } }> but was:<{ root : { } }>
      
      Standard Output
      
      07:00:24.428 INFO  [main] FileStoreBuilder.java:317         Creating file store FileStoreBuilder{version=1.8-SNAPSHOT, directory=target/junit8098268379030568272/junit5898494617453977971, blobStore=DataStore backed BlobStore [org.apache.jackrabbit.core.data.FileDataStore], maxFileSize=1, segmentCacheSize=0, stringCacheSize=0, templateCacheSize=0, stringDeduplicationCacheSize=15000, templateDeduplicationCacheSize=3000, nodeDeduplicationCacheSize=1, memoryMapping=false, gcOptions=SegmentGCOptions{paused=false, estimationDisabled=false, gcSizeDeltaEstimation=1073741824, retryCount=5, forceTimeout=60, retainedGenerations=2}}
      07:00:24.429 INFO  [main] FileStore.java:253                TarMK opened: target/junit8098268379030568272/junit5898494617453977971 (mmap=false)
      07:00:24.431 INFO  [main] FileStoreBuilder.java:317         Creating file store FileStoreBuilder{version=1.8-SNAPSHOT, directory=target/junit8098268379030568272/junit6599312574524835115, blobStore=DataStore backed BlobStore [org.apache.jackrabbit.core.data.FileDataStore], maxFileSize=1, segmentCacheSize=0, stringCacheSize=0, templateCacheSize=0, stringDeduplicationCacheSize=15000, templateDeduplicationCacheSize=3000, nodeDeduplicationCacheSize=1, memoryMapping=false, gcOptions=SegmentGCOptions{paused=false, estimationDisabled=false, gcSizeDeltaEstimation=1073741824, retryCount=5, forceTimeout=60, retainedGenerations=2}}
      07:00:24.432 INFO  [main] FileStore.java:253                TarMK opened: target/junit8098268379030568272/junit6599312574524835115 (mmap=false)
      07:00:24.436 INFO  [main] SegmentNodeStore.java:120         Creating segment node store SegmentNodeStoreBuilder{blobStore=DataStore backed BlobStore [org.apache.jackrabbit.core.data.FileDataStore]}
      07:00:24.437 INFO  [main] LockBasedScheduler.java:141       Initializing SegmentNodeStore with the commitFairLock option enabled.
      07:00:24.529 INFO  [main] NetworkErrorProxy.java:80         Starting proxy with flip=150, skip=0,0
      07:00:24.535 ERROR [main] StandbyServerSync.java:116        Server could not be started.
      java.lang.RuntimeException: java.net.BindException: Address already in use
      	at org.apache.jackrabbit.oak.segment.standby.server.StandbyServer.onTimelyConnect(StandbyServer.java:235) ~[oak-segment-tar-1.8-SNAPSHOT.jar:1.8-SNAPSHOT]
      	at org.apache.jackrabbit.oak.segment.standby.server.StandbyServer.start(StandbyServer.java:191) ~[oak-segment-tar-1.8-SNAPSHOT.jar:1.8-SNAPSHOT]
      	at org.apache.jackrabbit.oak.segment.standby.server.StandbyServerSync.start(StandbyServerSync.java:111) ~[oak-segment-tar-1.8-SNAPSHOT.jar:1.8-SNAPSHOT]
      	at org.apache.jackrabbit.oak.segment.standby.DataStoreTestBase.useProxy(DataStoreTestBase.java:206) [test-classes/:na]
      	at org.apache.jackrabbit.oak.segment.standby.DataStoreTestBase.testProxyFlippedIntermediateByteChange(DataStoreTestBase.java:183) [test-classes/:na]
      	at sun.reflect.NativeMethodAccessorImpl.invoke0(Native Method) ~[na:1.8.0_121]
      	at sun.reflect.NativeMethodAccessorImpl.invoke(NativeMethodAccessorImpl.java:62) ~[na:1.8.0_121]
      	at sun.reflect.DelegatingMethodAccessorImpl.invoke(DelegatingMethodAccessorImpl.java:43) ~[na:1.8.0_121]
      	at java.lang.reflect.Method.invoke(Method.java:498) ~[na:1.8.0_121]
      	at org.junit.runners.model.FrameworkMethod$1.runReflectiveCall(FrameworkMethod.java:50) [junit-4.12.jar:4.12]
      	at org.junit.internal.runners.model.ReflectiveCallable.run(ReflectiveCallable.java:12) [junit-4.12.jar:4.12]
      	at org.junit.runners.model.FrameworkMethod.invokeExplosively(FrameworkMethod.java:47) [junit-4.12.jar:4.12]
      	at org.junit.internal.runners.statements.InvokeMethod.evaluate(InvokeMethod.java:17) [junit-4.12.jar:4.12]
      	at org.junit.internal.runners.statements.RunBefores.evaluate(RunBefores.java:26) [junit-4.12.jar:4.12]
      	at org.junit.internal.runners.statements.RunAfters.evaluate(RunAfters.java:27) [junit-4.12.jar:4.12]
      	at org.junit.rules.ExternalResource$1.evaluate(ExternalResource.java:48) [junit-4.12.jar:4.12]
      	at org.junit.rules.ExternalResource$1.evaluate(ExternalResource.java:48) [junit-4.12.jar:4.12]
      	at org.junit.rules.ExternalResource$1.evaluate(ExternalResource.java:48) [junit-4.12.jar:4.12]
      	at org.junit.rules.ExternalResource$1.evaluate(ExternalResource.java:48) [junit-4.12.jar:4.12]
      	at org.junit.rules.ExternalResource$1.evaluate(ExternalResource.java:48) [junit-4.12.jar:4.12]
      	at org.junit.rules.ExternalResource$1.evaluate(ExternalResource.java:48) [junit-4.12.jar:4.12]
      	at org.junit.rules.ExternalResource$1.evaluate(ExternalResource.java:48) [junit-4.12.jar:4.12]
      	at org.junit.rules.RunRules.evaluate(RunRules.java:20) [junit-4.12.jar:4.12]
      	at org.junit.runners.ParentRunner.runLeaf(ParentRunner.java:325) [junit-4.12.jar:4.12]
      	at org.junit.runners.BlockJUnit4ClassRunner.runChild(BlockJUnit4ClassRunner.java:78) [junit-4.12.jar:4.12]
      	at org.junit.runners.BlockJUnit4ClassRunner.runChild(BlockJUnit4ClassRunner.java:57) [junit-4.12.jar:4.12]
      	at org.junit.runners.ParentRunner$3.run(ParentRunner.java:290) [junit-4.12.jar:4.12]
      	at org.junit.runners.ParentRunner$1.schedule(ParentRunner.java:71) [junit-4.12.jar:4.12]
      	at org.junit.runners.ParentRunner.runChildren(ParentRunner.java:288) [junit-4.12.jar:4.12]
      	at org.junit.runners.ParentRunner.access$000(ParentRunner.java:58) [junit-4.12.jar:4.12]
      	at org.junit.runners.ParentRunner$2.evaluate(ParentRunner.java:268) [junit-4.12.jar:4.12]
      	at org.junit.internal.runners.statements.RunBefores.evaluate(RunBefores.java:26) [junit-4.12.jar:4.12]
      	at org.junit.runners.ParentRunner.run(ParentRunner.java:363) [junit-4.12.jar:4.12]
      	at org.apache.maven.surefire.junit4.JUnit4Provider.execute(JUnit4Provider.java:367) [surefire-junit4-2.19.1.jar:2.19.1]
      	at org.apache.maven.surefire.junit4.JUnit4Provider.executeWithRerun(JUnit4Provider.java:274) [surefire-junit4-2.19.1.jar:2.19.1]
      	at org.apache.maven.surefire.junit4.JUnit4Provider.executeTestSet(JUnit4Provider.java:238) [surefire-junit4-2.19.1.jar:2.19.1]
      	at org.apache.maven.surefire.junit4.JUnit4Provider.invoke(JUnit4Provider.java:161) [surefire-junit4-2.19.1.jar:2.19.1]
      	at org.apache.maven.surefire.booter.ForkedBooter.invokeProviderInSameClassLoader(ForkedBooter.java:290) [surefire-booter-2.19.1.jar:2.19.1]
      	at org.apache.maven.surefire.booter.ForkedBooter.runSuitesInProcess(ForkedBooter.java:242) [surefire-booter-2.19.1.jar:2.19.1]
      	at org.apache.maven.surefire.booter.ForkedBooter.main(ForkedBooter.java:121) [surefire-booter-2.19.1.jar:2.19.1]
      Caused by: java.net.BindException: Address already in use
      	at sun.nio.ch.Net.bind0(Native Method) ~[na:1.8.0_121]
      	at sun.nio.ch.Net.bind(Net.java:433) ~[na:1.8.0_121]
      	at sun.nio.ch.Net.bind(Net.java:425) ~[na:1.8.0_121]
      	at sun.nio.ch.ServerSocketChannelImpl.bind(ServerSocketChannelImpl.java:223) ~[na:1.8.0_121]
      	at io.netty.channel.socket.nio.NioServerSocketChannel.doBind(NioServerSocketChannel.java:127) ~[netty-transport-4.0.41.Final.jar:4.0.41.Final]
      	at io.netty.channel.AbstractChannel$AbstractUnsafe.bind(AbstractChannel.java:501) ~[netty-transport-4.0.41.Final.jar:4.0.41.Final]
      	at io.netty.channel.DefaultChannelPipeline$HeadContext.bind(DefaultChannelPipeline.java:1218) ~[netty-transport-4.0.41.Final.jar:4.0.41.Final]
      	at io.netty.channel.AbstractChannelHandlerContext.invokeBind(AbstractChannelHandlerContext.java:505) ~[netty-transport-4.0.41.Final.jar:4.0.41.Final]
      	at io.netty.channel.AbstractChannelHandlerContext.bind(AbstractChannelHandlerContext.java:490) ~[netty-transport-4.0.41.Final.jar:4.0.41.Final]
      	at io.netty.channel.DefaultChannelPipeline.bind(DefaultChannelPipeline.java:965) ~[netty-transport-4.0.41.Final.jar:4.0.41.Final]
      	at io.netty.channel.AbstractChannel.bind(AbstractChannel.java:210) ~[netty-transport-4.0.41.Final.jar:4.0.41.Final]
      	at io.netty.bootstrap.AbstractBootstrap$2.run(AbstractBootstrap.java:353) ~[netty-transport-4.0.41.Final.jar:4.0.41.Final]
      	at io.netty.util.concurrent.SingleThreadEventExecutor.runAllTasks(SingleThreadEventExecutor.java:408) ~[netty-common-4.0.41.Final.jar:4.0.41.Final]
      	at io.netty.channel.nio.NioEventLoop.run(NioEventLoop.java:441) ~[netty-transport-4.0.41.Final.jar:4.0.41.Final]
      	at io.netty.util.concurrent.SingleThreadEventExecutor$2.run(SingleThreadEventExecutor.java:140) ~[netty-common-4.0.41.Final.jar:4.0.41.Final]
      	at java.lang.Thread.run(Thread.java:745) ~[na:1.8.0_121]
      07:00:24.538 DEBUG [standby-1] GetHeadRequestEncoder.java:33 Sending request from client ba5a4239-a0db-428d-9efb-b4616e1d1da2 for current head
      07:00:25.055 DEBUG [standby-run-53] StandbyClient.java:159  Channel closed
      07:00:25.055 ERROR [standby-run-53] StandbyClientSync.java:170 Failed synchronizing state.
      java.lang.IllegalStateException: Unable to fetch remote head
      	at org.apache.jackrabbit.oak.segment.standby.client.StandbyClientSyncExecution.execute(StandbyClientSyncExecution.java:67) ~[oak-segment-tar-1.8-SNAPSHOT.jar:1.8-SNAPSHOT]
      	at org.apache.jackrabbit.oak.segment.standby.client.StandbyClientSync.run(StandbyClientSync.java:156) ~[oak-segment-tar-1.8-SNAPSHOT.jar:1.8-SNAPSHOT]
      	at org.apache.jackrabbit.oak.segment.standby.DataStoreTestBase.useProxy(DataStoreTestBase.java:209) [test-classes/:na]
      	at org.apache.jackrabbit.oak.segment.standby.DataStoreTestBase.testProxyFlippedIntermediateByteChange(DataStoreTestBase.java:183) [test-classes/:na]
      	at sun.reflect.NativeMethodAccessorImpl.invoke0(Native Method) ~[na:1.8.0_121]
      	at sun.reflect.NativeMethodAccessorImpl.invoke(NativeMethodAccessorImpl.java:62) ~[na:1.8.0_121]
      	at sun.reflect.DelegatingMethodAccessorImpl.invoke(DelegatingMethodAccessorImpl.java:43) ~[na:1.8.0_121]
      	at java.lang.reflect.Method.invoke(Method.java:498) ~[na:1.8.0_121]
      	at org.junit.runners.model.FrameworkMethod$1.runReflectiveCall(FrameworkMethod.java:50) [junit-4.12.jar:4.12]
      	at org.junit.internal.runners.model.ReflectiveCallable.run(ReflectiveCallable.java:12) [junit-4.12.jar:4.12]
      	at org.junit.runners.model.FrameworkMethod.invokeExplosively(FrameworkMethod.java:47) [junit-4.12.jar:4.12]
      	at org.junit.internal.runners.statements.InvokeMethod.evaluate(InvokeMethod.java:17) [junit-4.12.jar:4.12]
      	at org.junit.internal.runners.statements.RunBefores.evaluate(RunBefores.java:26) [junit-4.12.jar:4.12]
      	at org.junit.internal.runners.statements.RunAfters.evaluate(RunAfters.java:27) [junit-4.12.jar:4.12]
      	at org.junit.rules.ExternalResource$1.evaluate(ExternalResource.java:48) [junit-4.12.jar:4.12]
      	at org.junit.rules.ExternalResource$1.evaluate(ExternalResource.java:48) [junit-4.12.jar:4.12]
      	at org.junit.rules.ExternalResource$1.evaluate(ExternalResource.java:48) [junit-4.12.jar:4.12]
      	at org.junit.rules.ExternalResource$1.evaluate(ExternalResource.java:48) [junit-4.12.jar:4.12]
      	at org.junit.rules.ExternalResource$1.evaluate(ExternalResource.java:48) [junit-4.12.jar:4.12]
      	at org.junit.rules.ExternalResource$1.evaluate(ExternalResource.java:48) [junit-4.12.jar:4.12]
      	at org.junit.rules.ExternalResource$1.evaluate(ExternalResource.java:48) [junit-4.12.jar:4.12]
      	at org.junit.rules.RunRules.evaluate(RunRules.java:20) [junit-4.12.jar:4.12]
      	at org.junit.runners.ParentRunner.runLeaf(ParentRunner.java:325) [junit-4.12.jar:4.12]
      	at org.junit.runners.BlockJUnit4ClassRunner.runChild(BlockJUnit4ClassRunner.java:78) [junit-4.12.jar:4.12]
      	at org.junit.runners.BlockJUnit4ClassRunner.runChild(BlockJUnit4ClassRunner.java:57) [junit-4.12.jar:4.12]
      	at org.junit.runners.ParentRunner$3.run(ParentRunner.java:290) [junit-4.12.jar:4.12]
      	at org.junit.runners.ParentRunner$1.schedule(ParentRunner.java:71) [junit-4.12.jar:4.12]
      	at org.junit.runners.ParentRunner.runChildren(ParentRunner.java:288) [junit-4.12.jar:4.12]
      	at org.junit.runners.ParentRunner.access$000(ParentRunner.java:58) [junit-4.12.jar:4.12]
      	at org.junit.runners.ParentRunner$2.evaluate(ParentRunner.java:268) [junit-4.12.jar:4.12]
      	at org.junit.internal.runners.statements.RunBefores.evaluate(RunBefores.java:26) [junit-4.12.jar:4.12]
      	at org.junit.runners.ParentRunner.run(ParentRunner.java:363) [junit-4.12.jar:4.12]
      	at org.apache.maven.surefire.junit4.JUnit4Provider.execute(JUnit4Provider.java:367) [surefire-junit4-2.19.1.jar:2.19.1]
      	at org.apache.maven.surefire.junit4.JUnit4Provider.executeWithRerun(JUnit4Provider.java:274) [surefire-junit4-2.19.1.jar:2.19.1]
      	at org.apache.maven.surefire.junit4.JUnit4Provider.executeTestSet(JUnit4Provider.java:238) [surefire-junit4-2.19.1.jar:2.19.1]
      	at org.apache.maven.surefire.junit4.JUnit4Provider.invoke(JUnit4Provider.java:161) [surefire-junit4-2.19.1.jar:2.19.1]
      	at org.apache.maven.surefire.booter.ForkedBooter.invokeProviderInSameClassLoader(ForkedBooter.java:290) [surefire-booter-2.19.1.jar:2.19.1]
      	at org.apache.maven.surefire.booter.ForkedBooter.runSuitesInProcess(ForkedBooter.java:242) [surefire-booter-2.19.1.jar:2.19.1]
      	at org.apache.maven.surefire.booter.ForkedBooter.main(ForkedBooter.java:121) [surefire-booter-2.19.1.jar:2.19.1]
      07:00:25.056 INFO  [main] NetworkErrorProxy.java:80         Starting proxy with flip=-1, skip=-1,0
      07:00:25.100 DEBUG [standby-2] GetHeadRequestEncoder.java:33 Sending request from client ba5a4239-a0db-428d-9efb-b4616e1d1da2 for current head
      07:00:25.602 WARN  [standby-2] ExceptionHandler.java:37     Exception caught on client ba5a4239-a0db-428d-9efb-b4616e1d1da2
      io.netty.handler.timeout.ReadTimeoutException: null
      07:00:25.603 DEBUG [standby-run-54] StandbyClient.java:159  Channel closed
      07:00:25.604 ERROR [standby-run-54] StandbyClientSync.java:170 Failed synchronizing state.
      java.lang.IllegalStateException: Unable to fetch remote head
      	at org.apache.jackrabbit.oak.segment.standby.client.StandbyClientSyncExecution.execute(StandbyClientSyncExecution.java:67) ~[oak-segment-tar-1.8-SNAPSHOT.jar:1.8-SNAPSHOT]
      	at org.apache.jackrabbit.oak.segment.standby.client.StandbyClientSync.run(StandbyClientSync.java:156) ~[oak-segment-tar-1.8-SNAPSHOT.jar:1.8-SNAPSHOT]
      	at org.apache.jackrabbit.oak.segment.standby.DataStoreTestBase.useProxy(DataStoreTestBase.java:221) [test-classes/:na]
      	at org.apache.jackrabbit.oak.segment.standby.DataStoreTestBase.testProxyFlippedIntermediateByteChange(DataStoreTestBase.java:183) [test-classes/:na]
      	at sun.reflect.NativeMethodAccessorImpl.invoke0(Native Method) ~[na:1.8.0_121]
      	at sun.reflect.NativeMethodAccessorImpl.invoke(NativeMethodAccessorImpl.java:62) ~[na:1.8.0_121]
      	at sun.reflect.DelegatingMethodAccessorImpl.invoke(DelegatingMethodAccessorImpl.java:43) ~[na:1.8.0_121]
      	at java.lang.reflect.Method.invoke(Method.java:498) ~[na:1.8.0_121]
      	at org.junit.runners.model.FrameworkMethod$1.runReflectiveCall(FrameworkMethod.java:50) [junit-4.12.jar:4.12]
      	at org.junit.internal.runners.model.ReflectiveCallable.run(ReflectiveCallable.java:12) [junit-4.12.jar:4.12]
      	at org.junit.runners.model.FrameworkMethod.invokeExplosively(FrameworkMethod.java:47) [junit-4.12.jar:4.12]
      	at org.junit.internal.runners.statements.InvokeMethod.evaluate(InvokeMethod.java:17) [junit-4.12.jar:4.12]
      	at org.junit.internal.runners.statements.RunBefores.evaluate(RunBefores.java:26) [junit-4.12.jar:4.12]
      	at org.junit.internal.runners.statements.RunAfters.evaluate(RunAfters.java:27) [junit-4.12.jar:4.12]
      	at org.junit.rules.ExternalResource$1.evaluate(ExternalResource.java:48) [junit-4.12.jar:4.12]
      	at org.junit.rules.ExternalResource$1.evaluate(ExternalResource.java:48) [junit-4.12.jar:4.12]
      	at org.junit.rules.ExternalResource$1.evaluate(ExternalResource.java:48) [junit-4.12.jar:4.12]
      	at org.junit.rules.ExternalResource$1.evaluate(ExternalResource.java:48) [junit-4.12.jar:4.12]
      	at org.junit.rules.ExternalResource$1.evaluate(ExternalResource.java:48) [junit-4.12.jar:4.12]
      	at org.junit.rules.ExternalResource$1.evaluate(ExternalResource.java:48) [junit-4.12.jar:4.12]
      	at org.junit.rules.ExternalResource$1.evaluate(ExternalResource.java:48) [junit-4.12.jar:4.12]
      	at org.junit.rules.RunRules.evaluate(RunRules.java:20) [junit-4.12.jar:4.12]
      	at org.junit.runners.ParentRunner.runLeaf(ParentRunner.java:325) [junit-4.12.jar:4.12]
      	at org.junit.runners.BlockJUnit4ClassRunner.runChild(BlockJUnit4ClassRunner.java:78) [junit-4.12.jar:4.12]
      	at org.junit.runners.BlockJUnit4ClassRunner.runChild(BlockJUnit4ClassRunner.java:57) [junit-4.12.jar:4.12]
      	at org.junit.runners.ParentRunner$3.run(ParentRunner.java:290) [junit-4.12.jar:4.12]
      	at org.junit.runners.ParentRunner$1.schedule(ParentRunner.java:71) [junit-4.12.jar:4.12]
      	at org.junit.runners.ParentRunner.runChildren(ParentRunner.java:288) [junit-4.12.jar:4.12]
      	at org.junit.runners.ParentRunner.access$000(ParentRunner.java:58) [junit-4.12.jar:4.12]
      	at org.junit.runners.ParentRunner$2.evaluate(ParentRunner.java:268) [junit-4.12.jar:4.12]
      	at org.junit.internal.runners.statements.RunBefores.evaluate(RunBefores.java:26) [junit-4.12.jar:4.12]
      	at org.junit.runners.ParentRunner.run(ParentRunner.java:363) [junit-4.12.jar:4.12]
      	at org.apache.maven.surefire.junit4.JUnit4Provider.execute(JUnit4Provider.java:367) [surefire-junit4-2.19.1.jar:2.19.1]
      	at org.apache.maven.surefire.junit4.JUnit4Provider.executeWithRerun(JUnit4Provider.java:274) [surefire-junit4-2.19.1.jar:2.19.1]
      	at org.apache.maven.surefire.junit4.JUnit4Provider.executeTestSet(JUnit4Provider.java:238) [surefire-junit4-2.19.1.jar:2.19.1]
      	at org.apache.maven.surefire.junit4.JUnit4Provider.invoke(JUnit4Provider.java:161) [surefire-junit4-2.19.1.jar:2.19.1]
      	at org.apache.maven.surefire.booter.ForkedBooter.invokeProviderInSameClassLoader(ForkedBooter.java:290) [surefire-booter-2.19.1.jar:2.19.1]
      	at org.apache.maven.surefire.booter.ForkedBooter.runSuitesInProcess(ForkedBooter.java:242) [surefire-booter-2.19.1.jar:2.19.1]
      	at org.apache.maven.surefire.booter.ForkedBooter.main(ForkedBooter.java:121) [surefire-booter-2.19.1.jar:2.19.1]
      07:00:27.860 DEBUG [main] StandbyClientSync.java:275        Group shut down
      07:00:27.863 DEBUG [main] StandbyServer.java:202            Channel disconnected
      07:00:27.863 DEBUG [main] StandbyServer.java:202            Channel disconnected
      07:00:27.863 DEBUG [main] StandbyServer.java:213            Boss group shut down
      07:00:27.869 DEBUG [main] StandbyServer.java:219            Worker group shut down
      07:00:27.958 INFO  [main] FileStore.java:446                TarMK closed: target/junit8098268379030568272/junit6599312574524835115
      07:00:27.997 INFO  [main] FileStore.java:446                TarMK closed: target/junit8098268379030568272/junit5898494617453977971
      

        Attachments

          Activity

            People

            • Assignee:
              Unassigned
              Reporter:
              hudson Hudson
            • Votes:
              0 Vote for this issue
              Watchers:
              2 Start watching this issue

              Dates

              • Created:
                Updated:
                Resolved: