Uploaded image for project: 'Jackrabbit Oak'
  1. Jackrabbit Oak
  2. OAK-6139

Test failure: SecurityProviderRegistrationTest.testRequiredAuthorizationConfigurationNotAvailable()

    XMLWordPrintableJSON

    Details

      Description

      Jenkins CI failure: https://builds.apache.org/view/J/job/Jackrabbit%20Oak/

      The build Jackrabbit Oak #220 has failed.
      First failed run: Jackrabbit Oak #220 console log

      [ERROR] Tests run: 11, Failures: 1, Errors: 0, Skipped: 0, Time elapsed: 2.813 s <<< FAILURE! - in org.apache.jackrabbit.oak.run.osgi.SecurityProviderRegistrationTest
      [ERROR] testRequiredAuthorizationConfigurationNotAvailable(org.apache.jackrabbit.oak.run.osgi.SecurityProviderRegistrationTest)  Time elapsed: 0.219 s  <<< FAILURE!
      org.codehaus.groovy.runtime.powerassert.PowerAssertionError: 
      assert securityProviderServiceReferences != null
             |                                 |
             null                              false
      	at org.apache.jackrabbit.oak.run.osgi.SecurityProviderRegistrationTest.testRequiredService(SecurityProviderRegistrationTest.groovy:318)
      	at org.apache.jackrabbit.oak.run.osgi.SecurityProviderRegistrationTest.this$3$testRequiredService(SecurityProviderRegistrationTest.groovy)
      	at org.apache.jackrabbit.oak.run.osgi.SecurityProviderRegistrationTest.testRequiredAuthorizationConfigurationNotAvailable(SecurityProviderRegistrationTest.groovy:81)
      

        Attachments

          Activity

            People

            • Assignee:
              Unassigned
              Reporter:
              hudson Hudson
            • Votes:
              0 Vote for this issue
              Watchers:
              1 Start watching this issue

              Dates

              • Created:
                Updated:
                Resolved: