Uploaded image for project: 'Jackrabbit Oak'
  1. Jackrabbit Oak
  2. OAK-5891

Test failure: org.apache.jackrabbit.oak.osgi.OSGiIT

    XMLWordPrintableJSON

    Details

    • Type: Bug
    • Status: Closed
    • Priority: Major
    • Resolution: Fixed
    • Affects Version/s: None
    • Fix Version/s: 1.7.0, 1.8.0
    • Component/s: None
    • Labels:
      None

      Description

      Failures

      Test results:
      40 tests failed.
      FAILED:  org.apache.jackrabbit.oak.osgi.OSGiIT.listServices
      
      Error Message:
      gave up waiting for service org.apache.jackrabbit.oak.spi.state.NodeStore
      
      Stack Trace:
      org.ops4j.pax.swissbox.tracker.ServiceLookupException: gave up waiting for service org.apache.jackrabbit.oak.spi.state.NodeStore
              at org.ops4j.pax.swissbox.tracker.ServiceLookup.getService(ServiceLookup.java:199)
              at org.ops4j.pax.swissbox.tracker.ServiceLookup.getService(ServiceLookup.java:136)
              at org.ops4j.pax.exam.inject.internal.ServiceInjector.injectField(ServiceInjector.java:89)
              at org.ops4j.pax.exam.inject.internal.ServiceInjector.injectDeclaredFields(ServiceInjector.java:69)
              at org.ops4j.pax.exam.inject.internal.ServiceInjector.injectFields(ServiceInjector.java:61)
              at org.ops4j.pax.exam.invoker.junit.internal.ContainerTestRunner.createTest(ContainerTestRunner.java:60)
              at org.junit.runners.BlockJUnit4ClassRunner$1.runReflectiveCall(BlockJUnit4ClassRunner.java:244)
              at org.junit.internal.runners.model.ReflectiveCallable.run(ReflectiveCallable.java:12)
              at org.junit.runners.BlockJUnit4ClassRunner.methodBlock(BlockJUnit4ClassRunner.java:241)
              at org.junit.runners.BlockJUnit4ClassRunner.runChild(BlockJUnit4ClassRunner.java:70)
              at org.ops4j.pax.exam.invoker.junit.internal.ContainerTestRunner.runChild(ContainerTestRunner.java:67)
              at org.ops4j.pax.exam.invoker.junit.internal.ContainerTestRunner.runChild(ContainerTestRunner.java:37)
              at org.junit.runners.ParentRunner$3.run(ParentRunner.java:238)
              at org.junit.runners.ParentRunner$1.schedule(ParentRunner.java:63)
              at org.junit.runners.ParentRunner.runChildren(ParentRunner.java:236)
              at org.junit.runners.ParentRunner.access$000(ParentRunner.java:53)
              at org.junit.runners.ParentRunner$2.evaluate(ParentRunner.java:229)
              at org.junit.runners.ParentRunner.run(ParentRunner.java:309)
              at org.junit.runner.JUnitCore.run(JUnitCore.java:160)
              at org.junit.runner.JUnitCore.run(JUnitCore.java:138)
              at org.ops4j.pax.exam.invoker.junit.internal.JUnitProbeInvoker.invokeViaJUnit(JUnitProbeInvoker.java:125)
              at org.ops4j.pax.exam.invoker.junit.internal.JUnitProbeInvoker.findAndInvoke(JUnitProbeInvoker.java:98)
              at org.ops4j.pax.exam.invoker.junit.internal.JUnitProbeInvoker.call(JUnitProbeInvoker.java:74)
              at org.ops4j.pax.exam.nat.internal.NativeTestContainer.call(NativeTestContainer.java:108)
              at org.ops4j.pax.exam.spi.reactors.EagerSingleStagedReactor.invoke(EagerSingleStagedReactor.java:109)
              at org.ops4j.pax.exam.junit.impl.ProbeRunner$2.evaluate(ProbeRunner.java:278)
              at org.junit.runners.ParentRunner.runLeaf(ParentRunner.java:325)
              at org.junit.runners.BlockJUnit4ClassRunner.runChild(BlockJUnit4ClassRunner.java:78)
              at org.junit.runners.BlockJUnit4ClassRunner.runChild(BlockJUnit4ClassRunner.java:57)
              at org.junit.runners.ParentRunner$3.run(ParentRunner.java:290)
              at org.junit.runners.ParentRunner$1.schedule(ParentRunner.java:71)
              at org.junit.runners.ParentRunner.runChildren(ParentRunner.java:288)
              at org.junit.runners.ParentRunner.access$000(ParentRunner.java:58)
              at org.junit.runners.ParentRunner$2.evaluate(ParentRunner.java:268)
              at org.junit.runners.ParentRunner.run(ParentRunner.java:363)
              at org.ops4j.pax.exam.junit.impl.ProbeRunner.run(ProbeRunner.java:112)
              at org.ops4j.pax.exam.junit.PaxExam.run(PaxExam.java:93)
              at org.apache.maven.surefire.junit4.JUnit4Provider.execute(JUnit4Provider.java:252)
              at org.apache.maven.surefire.junit4.JUnit4Provider.executeTestSet(JUnit4Provider.java:141)
              at org.apache.maven.surefire.junit4.JUnit4Provider.invoke(JUnit4Provider.java:112)
              at sun.reflect.NativeMethodAccessorImpl.invoke0(Native Method)
              at sun.reflect.NativeMethodAccessorImpl.invoke(NativeMethodAccessorImpl.java:62)
              at sun.reflect.DelegatingMethodAccessorImpl.invoke(DelegatingMethodAccessorImpl.java:43)
              at java.lang.reflect.Method.invoke(Method.java:498)
              at org.apache.maven.surefire.util.ReflectionUtils.invokeMethodWithArray(ReflectionUtils.java:189)
              at org.apache.maven.surefire.booter.ProviderFactory$ProviderProxy.invoke(ProviderFactory.java:165)
              at org.apache.maven.surefire.booter.ProviderFactory.invokeProvider(ProviderFactory.java:85)
              at org.apache.maven.surefire.booter.ForkedBooter.runSuitesInProcess(ForkedBooter.java:115)
              at org.apache.maven.surefire.booter.ForkedBooter.main(ForkedBooter.java:75)
      
      
      FAILED:  org.apache.jackrabbit.oak.osgi.OSGiIT.listBundles
      
      Error Message:
      gave up waiting for service org.apache.jackrabbit.oak.spi.state.NodeStore
      
      Stack Trace:
      org.ops4j.pax.swissbox.tracker.ServiceLookupException: gave up waiting for service org.apache.jackrabbit.oak.spi.state.NodeStore
              at org.ops4j.pax.swissbox.tracker.ServiceLookup.getService(ServiceLookup.java:199)
              at org.ops4j.pax.swissbox.tracker.ServiceLookup.getService(ServiceLookup.java:136)
              at org.ops4j.pax.exam.inject.internal.ServiceInjector.injectField(ServiceInjector.java:89)
              at org.ops4j.pax.exam.inject.internal.ServiceInjector.injectDeclaredFields(ServiceInjector.java:69)
              at org.ops4j.pax.exam.inject.internal.ServiceInjector.injectFields(ServiceInjector.java:61)
              at org.ops4j.pax.exam.invoker.junit.internal.ContainerTestRunner.createTest(ContainerTestRunner.java:60)
              at org.junit.runners.BlockJUnit4ClassRunner$1.runReflectiveCall(BlockJUnit4ClassRunner.java:244)
              at org.junit.internal.runners.model.ReflectiveCallable.run(ReflectiveCallable.java:12)
              at org.junit.runners.BlockJUnit4ClassRunner.methodBlock(BlockJUnit4ClassRunner.java:241)
              at org.junit.runners.BlockJUnit4ClassRunner.runChild(BlockJUnit4ClassRunner.java:70)
              at org.ops4j.pax.exam.invoker.junit.internal.ContainerTestRunner.runChild(ContainerTestRunner.java:67)
              at org.ops4j.pax.exam.invoker.junit.internal.ContainerTestRunner.runChild(ContainerTestRunner.java:37)
              at org.junit.runners.ParentRunner$3.run(ParentRunner.java:238)
              at org.junit.runners.ParentRunner$1.schedule(ParentRunner.java:63)
              at org.junit.runners.ParentRunner.runChildren(ParentRunner.java:236)
              at org.junit.runners.ParentRunner.access$000(ParentRunner.java:53)
              at org.junit.runners.ParentRunner$2.evaluate(ParentRunner.java:229)
              at org.junit.runners.ParentRunner.run(ParentRunner.java:309)
              at org.junit.runner.JUnitCore.run(JUnitCore.java:160)
              at org.junit.runner.JUnitCore.run(JUnitCore.java:138)
              at org.ops4j.pax.exam.invoker.junit.internal.JUnitProbeInvoker.invokeViaJUnit(JUnitProbeInvoker.java:125)
              at org.ops4j.pax.exam.invoker.junit.internal.JUnitProbeInvoker.findAndInvoke(JUnitProbeInvoker.java:98)
              at org.ops4j.pax.exam.invoker.junit.internal.JUnitProbeInvoker.call(JUnitProbeInvoker.java:74)
              at org.ops4j.pax.exam.nat.internal.NativeTestContainer.call(NativeTestContainer.java:108)
              at org.ops4j.pax.exam.spi.reactors.EagerSingleStagedReactor.invoke(EagerSingleStagedReactor.java:109)
              at org.ops4j.pax.exam.junit.impl.ProbeRunner$2.evaluate(ProbeRunner.java:278)
              at org.junit.runners.ParentRunner.runLeaf(ParentRunner.java:325)
              at org.junit.runners.BlockJUnit4ClassRunner.runChild(BlockJUnit4ClassRunner.java:78)
              at org.junit.runners.BlockJUnit4ClassRunner.runChild(BlockJUnit4ClassRunner.java:57)
              at org.junit.runners.ParentRunner$3.run(ParentRunner.java:290)
              at org.junit.runners.ParentRunner$1.schedule(ParentRunner.java:71)
              at org.junit.runners.ParentRunner.runChildren(ParentRunner.java:288)
              at org.junit.runners.ParentRunner.access$000(ParentRunner.java:58)
              at org.junit.runners.ParentRunner$2.evaluate(ParentRunner.java:268)
              at org.junit.runners.ParentRunner.run(ParentRunner.java:363)
              at org.ops4j.pax.exam.junit.impl.ProbeRunner.run(ProbeRunner.java:112)
              at org.ops4j.pax.exam.junit.PaxExam.run(PaxExam.java:93)
              at org.apache.maven.surefire.junit4.JUnit4Provider.execute(JUnit4Provider.java:252)
              at org.apache.maven.surefire.junit4.JUnit4Provider.executeTestSet(JUnit4Provider.java:141)
              at org.apache.maven.surefire.junit4.JUnit4Provider.invoke(JUnit4Provider.java:112)
              at sun.reflect.NativeMethodAccessorImpl.invoke0(Native Method)
              at sun.reflect.NativeMethodAccessorImpl.invoke(NativeMethodAccessorImpl.java:62)
              at sun.reflect.DelegatingMethodAccessorImpl.invoke(DelegatingMethodAccessorImpl.java:43)
              at java.lang.reflect.Method.invoke(Method.java:498)
              at org.apache.maven.surefire.util.ReflectionUtils.invokeMethodWithArray(ReflectionUtils.java:189)
              at org.apache.maven.surefire.booter.ProviderFactory$ProviderProxy.invoke(ProviderFactory.java:165)
              at org.apache.maven.surefire.booter.ProviderFactory.invokeProvider(ProviderFactory.java:85)
              at org.apache.maven.surefire.booter.ForkedBooter.runSuitesInProcess(ForkedBooter.java:115)
              at org.apache.maven.surefire.booter.ForkedBooter.main(ForkedBooter.java:75)
      .......
      

        Attachments

          Issue Links

            Activity

              People

              • Assignee:
                amitjain Amit Jain
                Reporter:
                amitjain Amit Jain
              • Votes:
                0 Vote for this issue
                Watchers:
                1 Start watching this issue

                Dates

                • Created:
                  Updated:
                  Resolved: