Uploaded image for project: 'Jackrabbit Oak'
  1. Jackrabbit Oak
  2. OAK-2496

InitializerTest failing with Mongo on 1.0 branch

    XMLWordPrintableJSON

    Details

    • Type: Bug
    • Status: Closed
    • Priority: Major
    • Resolution: Fixed
    • Affects Version/s: None
    • Fix Version/s: 1.0.12
    • Component/s: core, mongomk
    • Labels:
      None

      Description

      Currently on 1.0 branch following test failure is being seen

      Tests in error: 
        testInitializerMongoWithoutInitialContent(org.apache.jackrabbit.oak.plugins.document.InitializerTest): javax.jcr.nodetype.NoSuchNodeTypeException: Node type rep:User does not exist
      
      Tests run: 2035, Failures: 0, Errors: 1, Skipped: 80
      
      
      java.lang.RuntimeException: javax.jcr.nodetype.NoSuchNodeTypeException: Node type rep:User does not exist
      	at org.apache.jackrabbit.oak.security.user.UserInitializer.initialize(UserInitializer.java:134)
      	at org.apache.jackrabbit.oak.plugins.document.InitializerTest.testInitializerMongoWithoutInitialContent(InitializerTest.java:85)
      	at sun.reflect.NativeMethodAccessorImpl.invoke0(Native Method)
      	at sun.reflect.NativeMethodAccessorImpl.invoke(NativeMethodAccessorImpl.java:57)
      	at sun.reflect.DelegatingMethodAccessorImpl.invoke(DelegatingMethodAccessorImpl.java:43)
      	at org.junit.runners.model.FrameworkMethod$1.runReflectiveCall(FrameworkMethod.java:45)
      	at org.junit.internal.runners.model.ReflectiveCallable.run(ReflectiveCallable.java:15)
      	at org.junit.runners.model.FrameworkMethod.invokeExplosively(FrameworkMethod.java:42)
      	at org.junit.internal.runners.statements.InvokeMethod.evaluate(InvokeMethod.java:20)
      	at org.junit.internal.runners.statements.RunBefores.evaluate(RunBefores.java:28)
      	at org.junit.internal.runners.statements.RunAfters.evaluate(RunAfters.java:30)
      	at org.junit.runners.ParentRunner.runLeaf(ParentRunner.java:263)
      	at org.junit.runners.BlockJUnit4ClassRunner.runChild(BlockJUnit4ClassRunner.java:68)
      	at org.junit.runners.BlockJUnit4ClassRunner.runChild(BlockJUnit4ClassRunner.java:47)
      	at org.junit.runners.ParentRunner$3.run(ParentRunner.java:231)
      	at org.junit.runners.ParentRunner$1.schedule(ParentRunner.java:60)
      	at org.junit.runners.ParentRunner.runChildren(ParentRunner.java:229)
      	at org.junit.runners.ParentRunner.access$000(ParentRunner.java:50)
      	at org.junit.runners.ParentRunner$2.evaluate(ParentRunner.java:222)
      	at org.junit.internal.runners.statements.RunBefores.evaluate(RunBefores.java:28)
      	at org.junit.runners.ParentRunner.run(ParentRunner.java:300)
      	at org.junit.runner.JUnitCore.run(JUnitCore.java:157)
      	at com.intellij.junit4.JUnit4IdeaTestRunner.startRunnerWithArgs(JUnit4IdeaTestRunner.java:74)
      	at com.intellij.rt.execution.junit.JUnitStarter.prepareStreamsAndStart(JUnitStarter.java:211)
      	at com.intellij.rt.execution.junit.JUnitStarter.main(JUnitStarter.java:67)
      	at sun.reflect.NativeMethodAccessorImpl.invoke0(Native Method)
      	at sun.reflect.NativeMethodAccessorImpl.invoke(NativeMethodAccessorImpl.java:57)
      	at com.intellij.rt.execution.application.AppMain.main(AppMain.java:134)
      Caused by: javax.jcr.nodetype.NoSuchNodeTypeException: Node type rep:User does not exist
      	at org.apache.jackrabbit.oak.util.TreeUtil.addChild(TreeUtil.java:192)
      	at org.apache.jackrabbit.oak.security.user.UserProvider.createAuthorizableNode(UserProvider.java:253)
      	at org.apache.jackrabbit.oak.security.user.UserProvider.createUser(UserProvider.java:184)
      	at org.apache.jackrabbit.oak.security.user.UserManagerImpl.createUser(UserManagerImpl.java:154)
      	at org.apache.jackrabbit.oak.security.user.UserManagerImpl.createUser(UserManagerImpl.java:142)
      	at org.apache.jackrabbit.oak.security.user.UserInitializer.initialize(UserInitializer.java:123)
      	... 30 more
      

        Attachments

          Activity

            People

            • Assignee:
              mreutegg Marcel Reutegger
              Reporter:
              chetanm Chetan Mehrotra
            • Votes:
              0 Vote for this issue
              Watchers:
              1 Start watching this issue

              Dates

              • Created:
                Updated:
                Resolved: