Details

    • Type: Bug Bug
    • Status: Closed
    • Priority: Critical Critical
    • Resolution: Fixed
    • Affects Version/s: nutchgora
    • Fix Version/s: nutchgora
    • Component/s: fetcher, generator, injector, storage
    • Labels:
      None
    • Environment:

      Ubuntu release 11.04 (natty)
      Kernerl Linux 2.6.38-10-generic
      GNOME 2.32.1

      Description

      The following tests fail when running ant test on trunk 2.0

          [junit] Running org.apache.nutch.api.TestAPI
          [junit] Tests run: 4, Failures: 1, Errors: 0, Time elapsed: 11.028 sec
          [junit] Test org.apache.nutch.api.TestAPI FAILED
          [junit] Running org.apache.nutch.crawl.TestGenerator
          [junit] Tests run: 4, Failures: 0, Errors: 4, Time elapsed: 0.478 sec
          [junit] Test org.apache.nutch.crawl.TestGenerator FAILED
          [junit] Running org.apache.nutch.crawl.TestInjector
          [junit] Tests run: 1, Failures: 0, Errors: 1, Time elapsed: 0.474 sec
          [junit] Test org.apache.nutch.crawl.TestInjector FAILED
          [junit] Running org.apache.nutch.fetcher.TestFetcher
          [junit] Tests run: 2, Failures: 0, Errors: 2, Time elapsed: 0.526 sec
          [junit] Test org.apache.nutch.fetcher.TestFetcher FAILED
          [junit] Running org.apache.nutch.storage.TestGoraStorage
          [junit] Tests run: 2, Failures: 0, Errors: 2, Time elapsed: 0.468 sec
          [junit] Test org.apache.nutch.storage.TestGoraStorage FAILED
      

        Issue Links

          Activity

          Lewis John McGibbney created issue -
          Lewis John McGibbney made changes -
          Field Original Value New Value
          Description The following tests fail when running ant test on trunk 2.0
          {code}
              [junit] Running org.apache.nutch.api.TestAPI
              [junit] Tests run: 4, Failures: 1, Errors: 0, Time elapsed: 11.028 sec
              [junit] Test org.apache.nutch.api.TestAPI FAILED
              [junit] Running org.apache.nutch.crawl.TestGenerator
              [junit] Tests run: 4, Failures: 0, Errors: 4, Time elapsed: 0.478 sec
              [junit] Test org.apache.nutch.crawl.TestGenerator FAILED
              [junit] Running org.apache.nutch.crawl.TestInjector
              [junit] Tests run: 1, Failures: 0, Errors: 1, Time elapsed: 0.474 sec
              [junit] Test org.apache.nutch.crawl.TestInjector FAILED
              [junit] Running org.apache.nutch.fetcher.TestFetcher
              [junit] Tests run: 2, Failures: 0, Errors: 2, Time elapsed: 0.526 sec
              [junit] Test org.apache.nutch.fetcher.TestFetcher FAILED
              [junit] Running org.apache.nutch.storage.TestGoraStorage
              [junit] Tests run: 2, Failures: 0, Errors: 2, Time elapsed: 0.468 sec
              [junit] Test org.apache.nutch.storage.TestGoraStorage FAILED
          The following tests fail when running ant test on trunk 2.0
          {code}
              [junit] Running org.apache.nutch.api.TestAPI
              [junit] Tests run: 4, Failures: 1, Errors: 0, Time elapsed: 11.028 sec
              [junit] Test org.apache.nutch.api.TestAPI FAILED
              [junit] Running org.apache.nutch.crawl.TestGenerator
              [junit] Tests run: 4, Failures: 0, Errors: 4, Time elapsed: 0.478 sec
              [junit] Test org.apache.nutch.crawl.TestGenerator FAILED
              [junit] Running org.apache.nutch.crawl.TestInjector
              [junit] Tests run: 1, Failures: 0, Errors: 1, Time elapsed: 0.474 sec
              [junit] Test org.apache.nutch.crawl.TestInjector FAILED
              [junit] Running org.apache.nutch.fetcher.TestFetcher
              [junit] Tests run: 2, Failures: 0, Errors: 2, Time elapsed: 0.526 sec
              [junit] Test org.apache.nutch.fetcher.TestFetcher FAILED
              [junit] Running org.apache.nutch.storage.TestGoraStorage
              [junit] Tests run: 2, Failures: 0, Errors: 2, Time elapsed: 0.468 sec
              [junit] Test org.apache.nutch.storage.TestGoraStorage FAILED
          {code}
          Lewis John McGibbney made changes -
          Summary Trunk ant tests fail ant tests fail
          Lewis John McGibbney made changes -
          Assignee Lewis John McGibbney [ lewismc ]
          Priority Major [ 3 ] Critical [ 2 ]
          Lewis John McGibbney made changes -
          Link This issue is related to NUTCH-896 [ NUTCH-896 ]
          Lewis John McGibbney made changes -
          Status Open [ 1 ] Resolved [ 5 ]
          Resolution Fixed [ 1 ]
          Lewis John McGibbney made changes -
          Status Resolved [ 5 ] Closed [ 6 ]
          Lewis John McGibbney made changes -
          Resolution Fixed [ 1 ]
          Status Closed [ 6 ] Reopened [ 4 ]
          Lewis John McGibbney made changes -
          Fix Version/s 2.1 [ 12321040 ]
          Fix Version/s nutchgora [ 12314893 ]
          Lewis John McGibbney made changes -
          Status Reopened [ 4 ] Resolved [ 5 ]
          Fix Version/s nutchgora [ 12314893 ]
          Fix Version/s 2.1 [ 12321040 ]
          Resolution Fixed [ 1 ]
          Lewis John McGibbney made changes -
          Status Resolved [ 5 ] Closed [ 6 ]

            People

            • Assignee:
              Lewis John McGibbney
              Reporter:
              Lewis John McGibbney
            • Votes:
              0 Vote for this issue
              Watchers:
              3 Start watching this issue

              Dates

              • Created:
                Updated:
                Resolved:

                Development