Uploaded image for project: 'Apache NiFi'
  1. Apache NiFi
  2. NIFI-7751

Unit tests failing for TestExecuteStreamCommand

    XMLWordPrintableJSON

    Details

    • Type: Task
    • Status: Resolved
    • Priority: Minor
    • Resolution: Fixed
    • Affects Version/s: 1.12.0
    • Fix Version/s: 1.13.0, 1.12.1
    • Component/s: Tools and Build
    • Labels:
      None
    • Environment:

      Description

      https://github.com/apache/nifi/runs/1000428857

      [ERROR] Tests run: 36, Failures: 2, Errors: 0, Skipped: 1, Time elapsed: 5.476 s <<< FAILURE! - in org.apache.nifi.processors.standard.TestExecuteStreamCommand
      3176[ERROR] testLoggingToStdErr(org.apache.nifi.processors.standard.TestExecuteStreamCommand)  Time elapsed: 1.051 s  <<< FAILURE!
      3177org.junit.ComparisonFailure: expected:<[fffffffffffffffffffffffffffffff]> but was:<[Picked up JAVA_TOOL_OPTIONS: -D]>
      3178	at org.apache.nifi.processors.standard.TestExecuteStreamCommand.testLoggingToStdErr(TestExecuteStreamCommand.java:277)
      3179
      3180[ERROR] testLoggingToStdErrDynamicProperties(org.apache.nifi.processors.standard.TestExecuteStreamCommand)  Time elapsed: 1.093 s  <<< FAILURE!
      3181org.junit.ComparisonFailure: expected:<[fffffffffffffffffffffffffffffff]> but was:<[Picked up JAVA_TOOL_OPTIONS: -D]>
      3182	at org.apache.nifi.processors.standard.TestExecuteStreamCommand.testLoggingToStdErrDynamicProperties(TestExecuteStreamCommand.java:309)
      

        Attachments

          Issue Links

            Activity

              People

              • Assignee:
                pvillard Pierre Villard
                Reporter:
                pvillard Pierre Villard
              • Votes:
                0 Vote for this issue
                Watchers:
                3 Start watching this issue

                Dates

                • Created:
                  Updated:
                  Resolved:

                  Time Tracking

                  Estimated:
                  Original Estimate - Not Specified
                  Not Specified
                  Remaining:
                  Remaining Estimate - 0h
                  0h
                  Logged:
                  Time Spent - 1h
                  1h