Uploaded image for project: 'Apache NiFi'
  1. Apache NiFi
  2. NIFI-6015

nifi core framework brittle test in TestStandardProcessSession

    XMLWordPrintableJSON

    Details

    • Type: Bug
    • Status: Resolved
    • Priority: Major
    • Resolution: Fixed
    • Affects Version/s: None
    • Fix Version/s: 1.9.0
    • Component/s: None
    • Labels:
      None
    • Environment:

      Description

      [ERROR] Tests run: 60, Failures: 1, Errors: 0, Skipped: 1, Time elapsed: 0.101 s <<< FAILURE! - in org.apache.nifi.controller.repository.TestStandardProcessSession
      [ERROR] testBatchQueuedHaveSameQueuedTime(org.apache.nifi.controller.repository.TestStandardProcessSession) Time elapsed: 0.008 s <<< FAILURE!
      java.lang.AssertionError: Queued times should not be equal.. Actual: 1549903171660
      at org.apache.nifi.controller.repository.TestStandardProcessSession.testBatchQueuedHaveSameQueuedTime(TestStandardProcessSession.java:1727)

        Attachments

          Issue Links

            Activity

              People

              • Assignee:
                Unassigned
                Reporter:
                joewitt Joe Witt
              • Votes:
                0 Vote for this issue
                Watchers:
                2 Start watching this issue

                Dates

                • Created:
                  Updated:
                  Resolved:

                  Time Tracking

                  Estimated:
                  Original Estimate - Not Specified
                  Not Specified
                  Remaining:
                  Remaining Estimate - 0h
                  0h
                  Logged:
                  Time Spent - 40m
                  40m