Uploaded image for project: 'Apache NiFi'
  1. Apache NiFi
  2. NIFI-5558

NiFi build on master fails due to decryption issue

    XMLWordPrintableJSON

    Details

    • Type: Bug
    • Status: Resolved
    • Priority: Major
    • Resolution: Fixed
    • Affects Version/s: 1.7.1
    • Fix Version/s: 1.8.0
    • Component/s: Tools and Build
    • Environment:

      Description

      ERROR] Tests run: 2, Failures: 0, Errors: 1, Skipped: 0, Time elapsed: 1.39 s <<< FAILURE! - in org.apache.nifi.cluster.coordination.flow.PopularVoteFlowElectionFactoryBeanTest
      [ERROR] testGetObjectShouldPopulateDefaultSensitivePropsKeyIfEmpty(org.apache.nifi.cluster.coordination.flow.PopularVoteFlowElectionFactoryBeanTest) Time elapsed: 1.318 s <<< ERROR!
      org.apache.nifi.encrypt.EncryptionException: org.apache.nifi.encrypt.EncryptionException: Could not decrypt sensitive value
      at org.apache.nifi.cluster.coordination.flow.PopularVoteFlowElectionFactoryBeanTest.testGetObjectShouldPopulateDefaultSensitivePropsKeyIfEmpty(PopularVoteFlowElectionFactoryBeanTest.groovy:82)
      Caused by: org.apache.nifi.encrypt.EncryptionException: Could not decrypt sensitive value
      at org.apache.nifi.cluster.coordination.flow.PopularVoteFlowElectionFactoryBeanTest.testGetObjectShouldPopulateDefaultSensitivePropsKeyIfEmpty(PopularVoteFlowElectionFactoryBeanTest.groovy:82)
      Caused by: javax.crypto.BadPaddingException: pad block corrupted
      at org.apache.nifi.cluster.coordination.flow.PopularVoteFlowElectionFactoryBeanTest.testGetObjectShouldPopulateDefaultSensitivePropsKeyIfEmpty(PopularVoteFlowElectionFactoryBeanTest.groovy:82)

        Attachments

          Issue Links

            Activity

              People

              • Assignee:
                alopresto Andy LoPresto
                Reporter:
                joewitt Joe Witt
              • Votes:
                0 Vote for this issue
                Watchers:
                4 Start watching this issue

                Dates

                • Created:
                  Updated:
                  Resolved: