Uploaded image for project: 'Apache NiFi'
  1. Apache NiFi
  2. NIFI-5453

Test failure on build for nifi-nar-utils on master

    Details

    • Type: Bug
    • Status: Resolved
    • Priority: Blocker
    • Resolution: Duplicate
    • Affects Version/s: None
    • Fix Version/s: 1.8.0
    • Component/s: Core Framework
    • Labels:
      None
    • Environment:

      Description

      [INFO] Installing /development/code/nifi.git/nifi-nar-bundles/nifi-framework-bundle/nifi-framework/nifi-framework-nar-utils/target/nifi-framework-nar-utils-1.8.0-SNAPSHOT.jar to /development/maven-repo/org/apache/nifi/nifi-framework-nar-utils/1.8.0-SNAPSHOT/nifi-framework-nar-utils-1.8.0-SNAPSHOT.jar
      [INFO] Installing /development/code/nifi.git/nifi-nar-bundles/nifi-framework-bundle/nifi-framework/nifi-framework-nar-utils/pom.xml to /development/maven-repo/org/apache/nifi/nifi-framework-nar-utils/1.8.0-SNAPSHOT/nifi-framework-nar-utils-1.8.0-SNAPSHOT.pom
      [ERROR] Tests run: 8, Failures: 0, Errors: 1, Skipped: 0, Time elapsed: 0.613 s <<< FAILURE! - in org.apache.nifi.NiFiGroovyTest
      [ERROR] testInitializePropertiesShouldSetBootstrapKeyFromFile(org.apache.nifi.NiFiGroovyTest) Time elapsed: 0.06 s <<< ERROR!
      java.lang.IllegalArgumentException: There was an issue decrypting protected properties
      at org.apache.nifi.NiFiGroovyTest.testInitializePropertiesShouldSetBootstrapKeyFromFile(NiFiGroovyTest.groovy:166)
      Caused by: org.apache.nifi.properties.SensitivePropertyProtectionException: The key must be a valid hexadecimal key
      at org.apache.nifi.NiFiGroovyTest.testInitializePropertiesShouldSetBootstrapKeyFromFile(NiFiGroovyTest.groovy:166)

      [INFO]
      [INFO] Results:
      [INFO]
      [ERROR] Errors:
      [ERROR] NiFiGroovyTest.testInitializePropertiesShouldSetBootstrapKeyFromFile:166 ยป IllegalArgument
      [INFO]
      [ERROR] Tests run: 8, Failures: 0, Errors: 1, Skipped: 0

        Attachments

          Issue Links

            Activity

              People

              • Assignee:
                Unassigned
                Reporter:
                joewitt Joseph Witt
              • Votes:
                0 Vote for this issue
                Watchers:
                1 Start watching this issue

                Dates

                • Created:
                  Updated:
                  Resolved: