Uploaded image for project: 'Apache NiFi'
  1. Apache NiFi
  2. NIFI-4662

Lumberjack processors test is brittle

    XMLWordPrintableJSON

Details

    • Bug
    • Status: Resolved
    • Major
    • Resolution: Fixed
    • None
    • 1.5.0
    • Extensions, Tools and Build
    • None

    Description

      Tests run: 1, Failures: 1, Errors: 0, Skipped: 0, Time elapsed: 0.415 sec <<< FAILURE! - in org.apache.nifi.processors.lumberjack.handler.TestLumberjackSocketChannelHandler
      testBasicHandling(org.apache.nifi.processors.lumberjack.handler.TestLumberjackSocketChannelHandler) Time elapsed: 0.26 sec <<< FAILURE!
      java.lang.AssertionError: expected:<4> but was:<3>
      at org.apache.nifi.processors.lumberjack.handler.TestLumberjackSocketChannelHandler.run(TestLumberjackSocketChannelHandler.java:164)
      at org.apache.nifi.processors.lumberjack.handler.TestLumberjackSocketChannelHandler.testBasicHandling(TestLumberjackSocketChannelHandler.java:93)

      Attachments

        Issue Links

          Activity

            People

              joewitt Joe Witt
              joewitt Joe Witt
              Votes:
              0 Vote for this issue
              Watchers:
              2 Start watching this issue

              Dates

                Created:
                Updated:
                Resolved: