Uploaded image for project: 'NetBeans'
  1. NetBeans
  2. NETBEANS-4836

Travis build random failure for java.hints and other modules.

    XMLWordPrintableJSON

Details

    Description

      Travis builds are failed randomly for java.hints and other modules. Identify the timed out test cases and mark all of them as @RandomlyFails.

      https://travis-ci.org/github/apache/netbeans/builds/

       

       

      Time out
      ---------
      [junit] Test org.netbeans.modules.java.hints.AssignResultToVariableTest FAILED (timeout)
      [junit] Test org.netbeans.modules.java.hints.errors.CreateMethodTest FAILED (timeout)
      [junit] Test org.netbeans.modules.java.hints.introduce.IntroduceHintTest FAILED (timeout)

      Mostly failure
      --------------
      [junit] Test org.netbeans.modules.java.hints.HideFieldByVarTest FAILED, count 7
      [junit] Test org.netbeans.modules.java.hints.errors.ErrorHintsTest FAILED, count 4
      [junit] Test org.netbeans.modules.java.hints.errors.VarCompDeclarationTest FAILED, count 2

      Less Failure
      ------------
      [junit] Test org.netbeans.modules.java.hints.errors.AddFinalModifierTest FAILED,count 1
      [junit] Test org.netbeans.modules.java.hints.errors.RemoveOverrideTest FAILED, count 1
      [junit] Test org.netbeans.modules.java.hints.errors.AccessErrorTest FAILED, count 1
      [junit] Test org.netbeans.modules.java.hints.errors.RemoveFinalModifierFromVariableTest FAILED, count 1

       

      Attachments

        Issue Links

          Activity

            People

              singh-akhilesh Akhilesh Singh
              singh-akhilesh Akhilesh Singh
              Votes:
              0 Vote for this issue
              Watchers:
              4 Start watching this issue

              Dates

                Created:
                Updated:
                Resolved:

                Time Tracking

                  Estimated:
                  Original Estimate - Not Specified
                  Not Specified
                  Remaining:
                  Remaining Estimate - 0h
                  0h
                  Logged:
                  Time Spent - 40m
                  40m