Uploaded image for project: 'Maven'
  1. Maven
  2. MNG-6974

IT for MNG-5175 (Wagon HTTP) fails with JDK 14

    XMLWordPrintableJSON

Details

    Description

      [ERROR] Tests run: 846, Failures: 0, Errors: 1, Skipped: 0, Time elapsed: 210.078 s <<< FAILURE! - in org.apache.maven.it.IntegrationTestSuite
      [ERROR] testmng5175_ReadTimeOutFromSettings(org.apache.maven.it.MavenITmng5175WagonHttpTest) Time elapsed: 0.166 s <<< ERROR!
      org.apache.maven.it.VerificationException: Text not found in log: Could not transfer artifact org.apache.maven.its.mng5175:fake-dependency:pom:1.0-SNAPSHOT
      at org.apache.maven.it.MavenITmng5175WagonHttpTest.testmng5175_ReadTimeOutFromSettings(MavenITmng5175WagonHttpTest.java:128)

      https://github.com/apache/maven/pull/368/checks?check_run_id=941247515

      Attachments

        Issue Links

          Activity

            People

              michael-o Michael Osipov
              mickroll Michael Kroll
              Votes:
              0 Vote for this issue
              Watchers:
              4 Start watching this issue

              Dates

                Created:
                Updated:
                Resolved: