Uploaded image for project: 'Maven'
  1. Maven
  2. MNG-6098

Unable to run Maven test. Getting org.apache.maven.surefire.util.SurefireReflectionException:

    XMLWordPrintableJSON

    Details

    • Type: Bug
    • Status: Closed
    • Priority: Blocker
    • Resolution: Invalid
    • Affects Version/s: 3.3.9
    • Fix Version/s: None
    • Component/s: Dependencies, POM
    • Labels:
      None
    • Environment:
      Windows 10
    • Flags:
      Important

      Description

      [INFO] Scanning for projects...
      [INFO]
      [INFO] ------------------------------------------------------------------------
      [INFO] Building MavenSelenium3 0.0.1-SNAPSHOT
      [INFO] ------------------------------------------------------------------------
      [WARNING] The POM for org.testng:testng:jar:5.14.3 is invalid, transitive dependencies (if any) will not be available, enable debug logging for more details
      [WARNING] The POM for org.testng:testng:jar:5.14.4 is invalid, transitive dependencies (if any) will not be available, enable debug logging for more details
      [WARNING] The POM for org.testng:testng:jar:5.14.5 is invalid, transitive dependencies (if any) will not be available, enable debug logging for more details
      [INFO]
      [INFO] — maven-resources-plugin:2.6:resources (default-resources) @ MavenSelenium3 —
      [WARNING] Using platform encoding (Cp1252 actually) to copy filtered resources, i.e. build is platform dependent!
      [INFO] Copying 0 resource
      [INFO]
      [INFO] — maven-compiler-plugin:3.1:compile (default-compile) @ MavenSelenium3 —
      [INFO] Nothing to compile - all classes are up to date
      [INFO]
      [INFO] — maven-resources-plugin:2.6:testResources (default-testResources) @ MavenSelenium3 —
      [WARNING] Using platform encoding (Cp1252 actually) to copy filtered resources, i.e. build is platform dependent!
      [INFO] Copying 1 resource
      [INFO]
      [INFO] — maven-compiler-plugin:3.1:testCompile (default-testCompile) @ MavenSelenium3 —
      [INFO] Nothing to compile - all classes are up to date
      [INFO]
      [INFO] — maven-surefire-plugin:2.12.4:test (default-test) @ MavenSelenium3 —
      [INFO] Surefire report directory: C:\Users\RaviVinnakota\workspace\MavenSelenium3\target\surefire-reports

      -------------------------------------------------------
      T E S T S
      -------------------------------------------------------
      Running TestSuite
      org.apache.maven.surefire.util.SurefireReflectionException: java.lang.reflect.InvocationTargetException; nested exception is java.lang.reflect.InvocationTargetException: null
      java.lang.reflect.InvocationTargetException
      at sun.reflect.NativeMethodAccessorImpl.invoke0(Native Method)
      at sun.reflect.NativeMethodAccessorImpl.invoke(NativeMethodAccessorImpl.java:62)
      at sun.reflect.DelegatingMethodAccessorImpl.invoke(DelegatingMethodAccessorImpl.java:43)
      at java.lang.reflect.Method.invoke(Method.java:497)
      at org.apache.maven.surefire.util.ReflectionUtils.invokeMethodWithArray(ReflectionUtils.java:189)
      at org.apache.maven.surefire.booter.ProviderFactory$ProviderProxy.invoke(ProviderFactory.java:165)
      at org.apache.maven.surefire.booter.ProviderFactory.invokeProvider(ProviderFactory.java:85)
      at org.apache.maven.surefire.booter.ForkedBooter.runSuitesInProcess(ForkedBooter.java:115)
      at org.apache.maven.surefire.booter.ForkedBooter.main(ForkedBooter.java:75)
      Caused by: org.apache.maven.surefire.testset.TestSetFailedException: Unknown TestNG version 6.9.13.6
      at org.apache.maven.surefire.testng.TestNGExecutor.getConfigurator(TestNGExecutor.java:207)
      at org.apache.maven.surefire.testng.TestNGExecutor.run(TestNGExecutor.java:174)
      at org.apache.maven.surefire.testng.TestNGXmlTestSuite.execute(TestNGXmlTestSuite.java:92)
      at org.apache.maven.surefire.testng.TestNGProvider.invoke(TestNGProvider.java:96)
      ... 9 more

      Results :

      Tests run: 0, Failures: 0, Errors: 0, Skipped: 0

      [INFO] ------------------------------------------------------------------------
      [INFO] BUILD FAILURE
      [INFO] ------------------------------------------------------------------------
      [INFO] Total time: 3.218 s
      [INFO] Finished at: 2016-10-03T08:11:07+05:30
      [INFO] Final Memory: 13M/225M
      [INFO] ------------------------------------------------------------------------
      [ERROR] Failed to execute goal org.apache.maven.plugins:maven-surefire-plugin:2.12.4:test (default-test) on project MavenSelenium3: Execution default-test of goal org.apache.maven.plugins:maven-surefire-plugin:2.12.4:test failed: The forked VM terminated without saying properly goodbye. VM crash or System.exit called ? -> [Help 1]
      [ERROR]
      [ERROR] To see the full stack trace of the errors, re-run Maven with the -e switch.
      [ERROR] Re-run Maven using the -X switch to enable full debug logging.
      [ERROR]
      [ERROR] For more information about the errors and possible solutions, please read the following articles:
      [ERROR] [Help 1] http://cwiki.apache.org/confluence/display/MAVEN/PluginExecutionException

        Attachments

          Activity

            People

            • Assignee:
              gboue Guillaume Boué
              Reporter:
              V Ravi Sankar V Ravi Sankar
            • Votes:
              0 Vote for this issue
              Watchers:
              3 Start watching this issue

              Dates

              • Created:
                Updated:
                Resolved: