Uploaded image for project: 'Metron'
  1. Metron
  2. METRON-914

Build Metron failure

    XMLWordPrintableJSON

    Details

    • Type: Bug
    • Status: To Do
    • Priority: Major
    • Resolution: Unresolved
    • Affects Version/s: 0.4.0
    • Fix Version/s: None
    • Labels:
      None
    • Environment:
      Ubuntu 16.04.1
    • Flags:
      Important

      Description

      [INFO] metron-config ...................................... FAILURE [04:08 min]
      [INFO] metron-rest-client ................................. SKIPPED
      [INFO] metron-rest ........................................ SKIPPED
      [INFO] ------------------------------------------------------------------------
      [INFO] BUILD FAILURE
      [INFO] ------------------------------------------------------------------------
      [INFO] Total time: 58:04 min
      [INFO] Finished at: 2017-04-28T15:57:16+07:00
      [INFO] Final Memory: 141M/588M
      [INFO] ------------------------------------------------------------------------
      [ERROR] Failed to execute goal com.github.eirslett:frontend-maven-plugin:1.3:npm (npm install) on project metron-config: Failed to run task: 'npm install' failed. (error code 1) -> [Help 1]
      [ERROR]
      [ERROR] To see the full stack trace of the errors, re-run Maven with the -e switch.
      [ERROR] Re-run Maven using the -X switch to enable full debug logging.
      [ERROR]
      [ERROR] For more information about the errors and possible solutions, please read the following articles:
      [ERROR] [Help 1] http://cwiki.apache.org/confluence/display/MAVEN/MojoFailureException
      [ERROR]
      [ERROR] After correcting the problems, you can resume the build with the command
      [ERROR] mvn <goals> -rf :metron-config

        Attachments

        1. build.log.tar.gz
          582 kB
          GS Peter
        2. npm-debug.log
          809 kB
          GS Peter
        3. build.test.log.gz
          197 kB
          Ian Abreu

          Activity

            People

            • Assignee:
              Unassigned
              Reporter:
              gspeter GS Peter
            • Votes:
              2 Vote for this issue
              Watchers:
              8 Start watching this issue

              Dates

              • Created:
                Updated:

                Time Tracking

                Estimated:
                Original Estimate - 504h
                504h
                Remaining:
                Remaining Estimate - 504h
                504h
                Logged:
                Time Spent - Not Specified
                Not Specified