Uploaded image for project: 'Hadoop Map/Reduce'
  1. Hadoop Map/Reduce
  2. MAPREDUCE-6828

TestMiniMRChildTask is failing in branch-2 and branch-2.8 on mac

    Details

    • Type: Bug
    • Status: Open
    • Priority: Minor
    • Resolution: Unresolved
    • Affects Version/s: None
    • Fix Version/s: None
    • Component/s: test
    • Labels:
      None

      Description

      Running org.apache.hadoop.mapred.TestMiniMRChildTask
      Tests run: 3, Failures: 3, Errors: 0, Skipped: 0, Time elapsed: 107.644 sec <<< FAILURE! - in org.apache.hadoop.mapred.TestMiniMRChildTask
      testTaskEnv(org.apache.hadoop.mapred.TestMiniMRChildTask)  Time elapsed: 24.369 sec  <<< FAILURE!
      java.lang.AssertionError: The environment checker job failed.
      	at org.junit.Assert.fail(Assert.java:88)
      	at org.junit.Assert.assertTrue(Assert.java:41)
      	at org.apache.hadoop.mapred.TestMiniMRChildTask.runTestTaskEnv(TestMiniMRChildTask.java:550)
      	at org.apache.hadoop.mapred.TestMiniMRChildTask.testTaskEnv(TestMiniMRChildTask.java:472)
      
      testTaskOldEnv(org.apache.hadoop.mapred.TestMiniMRChildTask)  Time elapsed: 18.773 sec  <<< FAILURE!
      java.lang.AssertionError: The environment checker job failed.
      	at org.junit.Assert.fail(Assert.java:88)
      	at org.junit.Assert.assertTrue(Assert.java:41)
      	at org.apache.hadoop.mapred.TestMiniMRChildTask.runTestTaskEnv(TestMiniMRChildTask.java:550)
      	at org.apache.hadoop.mapred.TestMiniMRChildTask.testTaskOldEnv(TestMiniMRChildTask.java:496)
      
      testMapRedExecutionEnv(org.apache.hadoop.mapred.TestMiniMRChildTask)  Time elapsed: 23.931 sec  <<< FAILURE!
      java.lang.AssertionError: null
      	at org.junit.Assert.fail(Assert.java:86)
      	at org.junit.Assert.assertTrue(Assert.java:41)
      	at org.junit.Assert.assertTrue(Assert.java:52)
      	at org.apache.hadoop.mapred.TestMiniMRChildTask.launchTest(TestMiniMRChildTask.java:194)
      	at org.apache.hadoop.mapred.TestMiniMRChildTask.testMapRedExecutionEnv(TestMiniMRChildTask.java:448)
      

        Attachments

          Activity

            People

            • Assignee:
              Unassigned
              Reporter:
              ajisakaa Akira Ajisaka
            • Votes:
              0 Vote for this issue
              Watchers:
              1 Start watching this issue

              Dates

              • Created:
                Updated: