Uploaded image for project: 'Hadoop Map/Reduce'
  1. Hadoop Map/Reduce
  2. MAPREDUCE-6533

testDetermineCacheVisibilities of TestClientDistributedCacheManager is broken

    Details

    • Type: Bug
    • Status: Resolved
    • Priority: Major
    • Resolution: Fixed
    • Affects Version/s: None
    • Fix Version/s: 2.8.0, 3.0.0-alpha1
    • Component/s: None
    • Labels:
      None
    • Hadoop Flags:
      Reviewed
    1. MAPREDUCE-6533.2.patch
      2 kB
      Chang Li
    2. MAPREDUCE-6533.3.patch
      2 kB
      Chang Li
    3. MAPREDUCE-6533.4.patch
      3 kB
      Chang Li
    4. MAPREDUCE-6533.4.patch
      3 kB
      Chang Li
    5. MAPREDUCE-6533.5.patch
      3 kB
      Chang Li
    6. MAPREDUCE-6533.6.2.patch
      4 kB
      Chang Li
    7. MAPREDUCE-6533.6.3.patch
      4 kB
      Chang Li
    8. MAPREDUCE-6533.6.patch
      3 kB
      Chang Li
    9. MAPREDUCE-6533.patch
      1 kB
      Chang Li

      Activity

      Hide
      hadoopqa Hadoop QA added a comment -
      -1 overall



      Vote Subsystem Runtime Comment
      0 reexec 0m 5s docker + precommit patch detected.
      +1 @author 0m 0s The patch does not contain any @author tags.
      +1 test4tests 0m 0s The patch appears to include 1 new or modified test files.
      +1 mvninstall 3m 4s trunk passed
      +1 compile 0m 17s trunk passed with JDK v1.8.0_60
      +1 compile 0m 20s trunk passed with JDK v1.7.0_79
      +1 checkstyle 0m 13s trunk passed
      +1 mvneclipse 0m 13s trunk passed
      +1 findbugs 1m 7s trunk passed
      +1 javadoc 0m 22s trunk passed with JDK v1.8.0_60
      +1 javadoc 0m 24s trunk passed with JDK v1.7.0_79
      +1 mvninstall 0m 24s the patch passed
      +1 compile 0m 17s the patch passed with JDK v1.8.0_60
      +1 javac 0m 17s the patch passed
      +1 compile 0m 20s the patch passed with JDK v1.7.0_79
      +1 javac 0m 20s the patch passed
      +1 checkstyle 0m 11s the patch passed
      +1 mvneclipse 0m 14s the patch passed
      +1 whitespace 0m 0s Patch has no whitespace issues.
      +1 findbugs 1m 18s the patch passed
      +1 javadoc 0m 21s the patch passed with JDK v1.8.0_60
      +1 javadoc 0m 24s the patch passed with JDK v1.7.0_79
      +1 unit 1m 33s hadoop-mapreduce-client-core in the patch passed with JDK v1.8.0_60.
      +1 unit 1m 52s hadoop-mapreduce-client-core in the patch passed with JDK v1.7.0_79.
      -1 asflicense 0m 20s Patch generated 1 ASF License warnings.
      14m 19s



      Subsystem Report/Notes
      Docker Client=1.7.1 Server=1.7.1 Image:test-patch-base-hadoop-date2015-10-31
      JIRA Patch URL https://issues.apache.org/jira/secure/attachment/12769931/MAPREDUCE-6533.patch
      JIRA Issue MAPREDUCE-6533
      Optional Tests asflicense javac javadoc mvninstall unit findbugs checkstyle compile
      uname Linux 800c5805a3ff 3.13.0-36-lowlatency #63-Ubuntu SMP PREEMPT Wed Sep 3 21:56:12 UTC 2014 x86_64 x86_64 x86_64 GNU/Linux
      Build tool maven
      Personality /home/jenkins/jenkins-slave/workspace/PreCommit-MAPREDUCE-Build/patchprocess/apache-yetus-e77b1ce/precommit/personality/hadoop.sh
      git revision trunk / a4a6b5b
      Default Java 1.7.0_79
      Multi-JDK versions /usr/lib/jvm/java-8-oracle:1.8.0_60 /usr/lib/jvm/java-7-openjdk-amd64:1.7.0_79
      findbugs v3.0.0
      JDK v1.7.0_79 Test Results https://builds.apache.org/job/PreCommit-MAPREDUCE-Build/6105/testReport/
      asflicense https://builds.apache.org/job/PreCommit-MAPREDUCE-Build/6105/artifact/patchprocess/patch-asflicense-problems.txt
      modules C: hadoop-mapreduce-project/hadoop-mapreduce-client/hadoop-mapreduce-client-core U: hadoop-mapreduce-project/hadoop-mapreduce-client/hadoop-mapreduce-client-core
      Max memory used 227MB
      Powered by Apache Yetus http://yetus.apache.org
      Console output https://builds.apache.org/job/PreCommit-MAPREDUCE-Build/6105/console

      This message was automatically generated.

      Show
      hadoopqa Hadoop QA added a comment - -1 overall Vote Subsystem Runtime Comment 0 reexec 0m 5s docker + precommit patch detected. +1 @author 0m 0s The patch does not contain any @author tags. +1 test4tests 0m 0s The patch appears to include 1 new or modified test files. +1 mvninstall 3m 4s trunk passed +1 compile 0m 17s trunk passed with JDK v1.8.0_60 +1 compile 0m 20s trunk passed with JDK v1.7.0_79 +1 checkstyle 0m 13s trunk passed +1 mvneclipse 0m 13s trunk passed +1 findbugs 1m 7s trunk passed +1 javadoc 0m 22s trunk passed with JDK v1.8.0_60 +1 javadoc 0m 24s trunk passed with JDK v1.7.0_79 +1 mvninstall 0m 24s the patch passed +1 compile 0m 17s the patch passed with JDK v1.8.0_60 +1 javac 0m 17s the patch passed +1 compile 0m 20s the patch passed with JDK v1.7.0_79 +1 javac 0m 20s the patch passed +1 checkstyle 0m 11s the patch passed +1 mvneclipse 0m 14s the patch passed +1 whitespace 0m 0s Patch has no whitespace issues. +1 findbugs 1m 18s the patch passed +1 javadoc 0m 21s the patch passed with JDK v1.8.0_60 +1 javadoc 0m 24s the patch passed with JDK v1.7.0_79 +1 unit 1m 33s hadoop-mapreduce-client-core in the patch passed with JDK v1.8.0_60. +1 unit 1m 52s hadoop-mapreduce-client-core in the patch passed with JDK v1.7.0_79. -1 asflicense 0m 20s Patch generated 1 ASF License warnings. 14m 19s Subsystem Report/Notes Docker Client=1.7.1 Server=1.7.1 Image:test-patch-base-hadoop-date2015-10-31 JIRA Patch URL https://issues.apache.org/jira/secure/attachment/12769931/MAPREDUCE-6533.patch JIRA Issue MAPREDUCE-6533 Optional Tests asflicense javac javadoc mvninstall unit findbugs checkstyle compile uname Linux 800c5805a3ff 3.13.0-36-lowlatency #63-Ubuntu SMP PREEMPT Wed Sep 3 21:56:12 UTC 2014 x86_64 x86_64 x86_64 GNU/Linux Build tool maven Personality /home/jenkins/jenkins-slave/workspace/PreCommit-MAPREDUCE-Build/patchprocess/apache-yetus-e77b1ce/precommit/personality/hadoop.sh git revision trunk / a4a6b5b Default Java 1.7.0_79 Multi-JDK versions /usr/lib/jvm/java-8-oracle:1.8.0_60 /usr/lib/jvm/java-7-openjdk-amd64:1.7.0_79 findbugs v3.0.0 JDK v1.7.0_79 Test Results https://builds.apache.org/job/PreCommit-MAPREDUCE-Build/6105/testReport/ asflicense https://builds.apache.org/job/PreCommit-MAPREDUCE-Build/6105/artifact/patchprocess/patch-asflicense-problems.txt modules C: hadoop-mapreduce-project/hadoop-mapreduce-client/hadoop-mapreduce-client-core U: hadoop-mapreduce-project/hadoop-mapreduce-client/hadoop-mapreduce-client-core Max memory used 227MB Powered by Apache Yetus http://yetus.apache.org Console output https://builds.apache.org/job/PreCommit-MAPREDUCE-Build/6105/console This message was automatically generated.
      Hide
      jlowe Jason Lowe added a comment -

      Could you elaborate on what the problem is, and how the patch proposes to fix it? This is a test that's been around a while, so I'm curious what changed recently to break it.

      The patch changes path concatenation from a cross-platform manner using File to a harcoded form – why was this done?

      Show
      jlowe Jason Lowe added a comment - Could you elaborate on what the problem is, and how the patch proposes to fix it? This is a test that's been around a while, so I'm curious what changed recently to break it. The patch changes path concatenation from a cross-platform manner using File to a harcoded form – why was this done?
      Hide
      lichangleo Chang Li added a comment -

      Jason Lowe, thanks for review and comment concerns! Right, this broken test used to work, its current error seem to be caused by jdk change. In the test, the TEST_ROOT_DIR is

      file:/Users/changli/hadoop/hadoop/hadoop-mapreduce-project/hadoop-mapreduce-client/hadoop-mapreduce-client-core/target/test-dir/ 

      when I run the test on my machine. But TEST_VISIBILITY_DIR is

       file:/Users/changli/hadoop/hadoop/hadoop-mapreduce-project/hadoop-mapreduce-client/hadoop-mapreduce-client-core/file:/Users/changli/hadoop/hadoop/hadoop-mapreduce-project/hadoop-mapreduce-client/hadoop-mapreduce-client-core/target/test-dir/TestCacheVisibility/

      which used to be

      file:/Users/changli/hadoop/hadoop/hadoop-mapreduce-project/hadoop-mapreduce-client/hadoop-mapreduce-client-core/target/test-dir/TestCacheVisibility

      . When a file created by File(String parent, String child), its absolute pathname and pathname differed as above. The testDetermineCacheVisibilities intended to test under file:/Users/changli/hadoop/hadoop/hadoop-mapreduce-project/hadoop-mapreduce-client/hadoop-mapreduce-client-core/target/test-dir/TestCacheVisibility which is TestCacheVisibility dir under TEST_ROOT_DIR, so I reconstruct the TEST_VISIBILITY_DIR string by this simple way rather than the unnecessarily complicate means from File to URI then to String.

      Show
      lichangleo Chang Li added a comment - Jason Lowe , thanks for review and comment concerns! Right, this broken test used to work, its current error seem to be caused by jdk change. In the test, the TEST_ROOT_DIR is file:/Users/changli/hadoop/hadoop/hadoop-mapreduce-project/hadoop-mapreduce-client/hadoop-mapreduce-client-core/target/test-dir/ when I run the test on my machine. But TEST_VISIBILITY_DIR is file:/Users/changli/hadoop/hadoop/hadoop-mapreduce-project/hadoop-mapreduce-client/hadoop-mapreduce-client-core/file:/Users/changli/hadoop/hadoop/hadoop-mapreduce-project/hadoop-mapreduce-client/hadoop-mapreduce-client-core/target/test-dir/TestCacheVisibility/ which used to be file:/Users/changli/hadoop/hadoop/hadoop-mapreduce-project/hadoop-mapreduce-client/hadoop-mapreduce-client-core/target/test-dir/TestCacheVisibility . When a file created by File(String parent, String child) , its absolute pathname and pathname differed as above. The testDetermineCacheVisibilities intended to test under file:/Users/changli/hadoop/hadoop/hadoop-mapreduce-project/hadoop-mapreduce-client/hadoop-mapreduce-client-core/target/test-dir/TestCacheVisibility which is TestCacheVisibility dir under TEST_ROOT_DIR , so I reconstruct the TEST_VISIBILITY_DIR string by this simple way rather than the unnecessarily complicate means from File to URI then to String.
      Hide
      jlowe Jason Lowe added a comment -

      The problem is not the File constructor but rather the result when it gets turned into a URI. The File constructor call is building the path file:/Users/changli/hadoop/hadoop/hadoop-mapreduce-project/hadoop-mapreduce-client/hadoop-mapreduce-client-core/target/test-dir/TestCacheVisibility correctly.

      Since TEST_ROOT_DIR and TEST_VISIBILITY_DIR always want to be treated as Path objects then a better fix would be to simply create them as such. I don't see a need for the extraneous string replacement and URI conversions. Then it's not hardcoded on a certain path separator and the code is cleaner.

      Show
      jlowe Jason Lowe added a comment - The problem is not the File constructor but rather the result when it gets turned into a URI. The File constructor call is building the path file:/Users/changli/hadoop/hadoop/hadoop-mapreduce-project/hadoop-mapreduce-client/hadoop-mapreduce-client-core/target/test-dir/TestCacheVisibility correctly. Since TEST_ROOT_DIR and TEST_VISIBILITY_DIR always want to be treated as Path objects then a better fix would be to simply create them as such. I don't see a need for the extraneous string replacement and URI conversions. Then it's not hardcoded on a certain path separator and the code is cleaner.
      Hide
      lichangleo Chang Li added a comment -

      Thanks Jason Lowe for review! have updated .2 patch according to your suggestion to create them as Path object

      Show
      lichangleo Chang Li added a comment - Thanks Jason Lowe for review! have updated .2 patch according to your suggestion to create them as Path object
      Hide
      hadoopqa Hadoop QA added a comment -
      -1 overall



      Vote Subsystem Runtime Comment
      0 reexec 0m 17s docker + precommit patch detected.
      +1 @author 0m 0s The patch does not contain any @author tags.
      +1 test4tests 0m 0s The patch appears to include 1 new or modified test files.
      +1 mvninstall 4m 50s trunk passed
      +1 compile 0m 28s trunk passed with JDK v1.8.0_60
      +1 compile 0m 23s trunk passed with JDK v1.7.0_79
      +1 checkstyle 0m 12s trunk passed
      +1 mvneclipse 0m 15s trunk passed
      +1 findbugs 1m 10s trunk passed
      +1 javadoc 0m 28s trunk passed with JDK v1.8.0_60
      +1 javadoc 0m 28s trunk passed with JDK v1.7.0_79
      +1 mvninstall 0m 29s the patch passed
      +1 compile 0m 22s the patch passed with JDK v1.8.0_60
      +1 javac 0m 22s the patch passed
      +1 compile 0m 24s the patch passed with JDK v1.7.0_79
      +1 javac 0m 24s the patch passed
      +1 checkstyle 0m 13s the patch passed
      +1 mvneclipse 0m 14s the patch passed
      -1 whitespace 0m 0s The patch has 1 line(s) that end in whitespace. Use git apply --whitespace=fix.
      +1 findbugs 1m 23s the patch passed
      +1 javadoc 0m 25s the patch passed with JDK v1.8.0_60
      +1 javadoc 0m 29s the patch passed with JDK v1.7.0_79
      +1 unit 1m 51s hadoop-mapreduce-client-core in the patch passed with JDK v1.8.0_60.
      -1 unit 2m 8s hadoop-mapreduce-client-core in the patch failed with JDK v1.7.0_79.
      -1 asflicense 0m 29s Patch generated 1 ASF License warnings.
      18m 12s



      Reason Tests
      JDK v1.7.0_79 Failed junit tests hadoop.mapred.TestJobEndNotifier



      Subsystem Report/Notes
      Docker Client=1.7.1 Server=1.7.1 Image:test-patch-base-hadoop-date2015-11-04
      JIRA Patch URL https://issues.apache.org/jira/secure/attachment/12770659/MAPREDUCE-6533.2.patch
      JIRA Issue MAPREDUCE-6533
      Optional Tests asflicense javac javadoc mvninstall unit findbugs checkstyle compile
      uname Linux 1888ed5ad363 3.13.0-36-lowlatency #63-Ubuntu SMP PREEMPT Wed Sep 3 21:56:12 UTC 2014 x86_64 x86_64 x86_64 GNU/Linux
      Build tool maven
      Personality /home/jenkins/jenkins-slave/workspace/PreCommit-MAPREDUCE-Build/patchprocess/apache-yetus-e8bd3ad/precommit/personality/hadoop.sh
      git revision trunk / 5667129
      Default Java 1.7.0_79
      Multi-JDK versions /usr/lib/jvm/java-8-oracle:1.8.0_60 /usr/lib/jvm/java-7-openjdk-amd64:1.7.0_79
      findbugs v3.0.0
      whitespace https://builds.apache.org/job/PreCommit-MAPREDUCE-Build/6116/artifact/patchprocess/whitespace-eol.txt
      unit https://builds.apache.org/job/PreCommit-MAPREDUCE-Build/6116/artifact/patchprocess/patch-unit-hadoop-mapreduce-project_hadoop-mapreduce-client_hadoop-mapreduce-client-core-jdk1.7.0_79.txt
      unit test logs https://builds.apache.org/job/PreCommit-MAPREDUCE-Build/6116/artifact/patchprocess/patch-unit-hadoop-mapreduce-project_hadoop-mapreduce-client_hadoop-mapreduce-client-core-jdk1.7.0_79.txt
      JDK v1.7.0_79 Test Results https://builds.apache.org/job/PreCommit-MAPREDUCE-Build/6116/testReport/
      asflicense https://builds.apache.org/job/PreCommit-MAPREDUCE-Build/6116/artifact/patchprocess/patch-asflicense-problems.txt
      modules C: hadoop-mapreduce-project/hadoop-mapreduce-client/hadoop-mapreduce-client-core U: hadoop-mapreduce-project/hadoop-mapreduce-client/hadoop-mapreduce-client-core
      Max memory used 225MB
      Powered by Apache Yetus http://yetus.apache.org
      Console output https://builds.apache.org/job/PreCommit-MAPREDUCE-Build/6116/console

      This message was automatically generated.

      Show
      hadoopqa Hadoop QA added a comment - -1 overall Vote Subsystem Runtime Comment 0 reexec 0m 17s docker + precommit patch detected. +1 @author 0m 0s The patch does not contain any @author tags. +1 test4tests 0m 0s The patch appears to include 1 new or modified test files. +1 mvninstall 4m 50s trunk passed +1 compile 0m 28s trunk passed with JDK v1.8.0_60 +1 compile 0m 23s trunk passed with JDK v1.7.0_79 +1 checkstyle 0m 12s trunk passed +1 mvneclipse 0m 15s trunk passed +1 findbugs 1m 10s trunk passed +1 javadoc 0m 28s trunk passed with JDK v1.8.0_60 +1 javadoc 0m 28s trunk passed with JDK v1.7.0_79 +1 mvninstall 0m 29s the patch passed +1 compile 0m 22s the patch passed with JDK v1.8.0_60 +1 javac 0m 22s the patch passed +1 compile 0m 24s the patch passed with JDK v1.7.0_79 +1 javac 0m 24s the patch passed +1 checkstyle 0m 13s the patch passed +1 mvneclipse 0m 14s the patch passed -1 whitespace 0m 0s The patch has 1 line(s) that end in whitespace. Use git apply --whitespace=fix. +1 findbugs 1m 23s the patch passed +1 javadoc 0m 25s the patch passed with JDK v1.8.0_60 +1 javadoc 0m 29s the patch passed with JDK v1.7.0_79 +1 unit 1m 51s hadoop-mapreduce-client-core in the patch passed with JDK v1.8.0_60. -1 unit 2m 8s hadoop-mapreduce-client-core in the patch failed with JDK v1.7.0_79. -1 asflicense 0m 29s Patch generated 1 ASF License warnings. 18m 12s Reason Tests JDK v1.7.0_79 Failed junit tests hadoop.mapred.TestJobEndNotifier Subsystem Report/Notes Docker Client=1.7.1 Server=1.7.1 Image:test-patch-base-hadoop-date2015-11-04 JIRA Patch URL https://issues.apache.org/jira/secure/attachment/12770659/MAPREDUCE-6533.2.patch JIRA Issue MAPREDUCE-6533 Optional Tests asflicense javac javadoc mvninstall unit findbugs checkstyle compile uname Linux 1888ed5ad363 3.13.0-36-lowlatency #63-Ubuntu SMP PREEMPT Wed Sep 3 21:56:12 UTC 2014 x86_64 x86_64 x86_64 GNU/Linux Build tool maven Personality /home/jenkins/jenkins-slave/workspace/PreCommit-MAPREDUCE-Build/patchprocess/apache-yetus-e8bd3ad/precommit/personality/hadoop.sh git revision trunk / 5667129 Default Java 1.7.0_79 Multi-JDK versions /usr/lib/jvm/java-8-oracle:1.8.0_60 /usr/lib/jvm/java-7-openjdk-amd64:1.7.0_79 findbugs v3.0.0 whitespace https://builds.apache.org/job/PreCommit-MAPREDUCE-Build/6116/artifact/patchprocess/whitespace-eol.txt unit https://builds.apache.org/job/PreCommit-MAPREDUCE-Build/6116/artifact/patchprocess/patch-unit-hadoop-mapreduce-project_hadoop-mapreduce-client_hadoop-mapreduce-client-core-jdk1.7.0_79.txt unit test logs https://builds.apache.org/job/PreCommit-MAPREDUCE-Build/6116/artifact/patchprocess/patch-unit-hadoop-mapreduce-project_hadoop-mapreduce-client_hadoop-mapreduce-client-core-jdk1.7.0_79.txt JDK v1.7.0_79 Test Results https://builds.apache.org/job/PreCommit-MAPREDUCE-Build/6116/testReport/ asflicense https://builds.apache.org/job/PreCommit-MAPREDUCE-Build/6116/artifact/patchprocess/patch-asflicense-problems.txt modules C: hadoop-mapreduce-project/hadoop-mapreduce-client/hadoop-mapreduce-client-core U: hadoop-mapreduce-project/hadoop-mapreduce-client/hadoop-mapreduce-client-core Max memory used 225MB Powered by Apache Yetus http://yetus.apache.org Console output https://builds.apache.org/job/PreCommit-MAPREDUCE-Build/6116/console This message was automatically generated.
      Hide
      lichangleo Chang Li added a comment -

      .3 patch fix whitespace issue

      Show
      lichangleo Chang Li added a comment - .3 patch fix whitespace issue
      Hide
      hadoopqa Hadoop QA added a comment -
      -1 overall



      Vote Subsystem Runtime Comment
      0 reexec 0m 15s docker + precommit patch detected.
      +1 @author 0m 0s The patch does not contain any @author tags.
      +1 test4tests 0m 0s The patch appears to include 1 new or modified test files.
      +1 mvninstall 3m 53s trunk passed
      +1 compile 0m 22s trunk passed with JDK v1.8.0_60
      +1 compile 0m 22s trunk passed with JDK v1.7.0_79
      +1 checkstyle 0m 13s trunk passed
      +1 mvneclipse 0m 16s trunk passed
      +1 findbugs 1m 10s trunk passed
      +1 javadoc 0m 28s trunk passed with JDK v1.8.0_60
      +1 javadoc 0m 30s trunk passed with JDK v1.7.0_79
      +1 mvninstall 0m 31s the patch passed
      +1 compile 0m 25s the patch passed with JDK v1.8.0_60
      +1 javac 0m 25s the patch passed
      +1 compile 0m 26s the patch passed with JDK v1.7.0_79
      +1 javac 0m 26s the patch passed
      +1 checkstyle 0m 14s the patch passed
      +1 mvneclipse 0m 16s the patch passed
      +1 whitespace 0m 0s Patch has no whitespace issues.
      +1 findbugs 1m 24s the patch passed
      +1 javadoc 0m 28s the patch passed with JDK v1.8.0_60
      +1 javadoc 0m 31s the patch passed with JDK v1.7.0_79
      +1 unit 1m 52s hadoop-mapreduce-client-core in the patch passed with JDK v1.8.0_60.
      +1 unit 2m 8s hadoop-mapreduce-client-core in the patch passed with JDK v1.7.0_79.
      -1 asflicense 0m 23s Patch generated 1 ASF License warnings.
      17m 24s



      Subsystem Report/Notes
      Docker Client=1.7.1 Server=1.7.1 Image:test-patch-base-hadoop-date2015-11-05
      JIRA Patch URL https://issues.apache.org/jira/secure/attachment/12770707/MAPREDUCE-6533.3.patch
      JIRA Issue MAPREDUCE-6533
      Optional Tests asflicense javac javadoc mvninstall unit findbugs checkstyle compile
      uname Linux 29af941d9a12 3.13.0-36-lowlatency #63-Ubuntu SMP PREEMPT Wed Sep 3 21:56:12 UTC 2014 x86_64 x86_64 x86_64 GNU/Linux
      Build tool maven
      Personality /home/jenkins/jenkins-slave/workspace/PreCommit-MAPREDUCE-Build/patchprocess/apache-yetus-e8bd3ad/precommit/personality/hadoop.sh
      git revision trunk / 5667129
      Default Java 1.7.0_79
      Multi-JDK versions /usr/lib/jvm/java-8-oracle:1.8.0_60 /usr/lib/jvm/java-7-openjdk-amd64:1.7.0_79
      findbugs v3.0.0
      JDK v1.7.0_79 Test Results https://builds.apache.org/job/PreCommit-MAPREDUCE-Build/6117/testReport/
      asflicense https://builds.apache.org/job/PreCommit-MAPREDUCE-Build/6117/artifact/patchprocess/patch-asflicense-problems.txt
      modules C: hadoop-mapreduce-project/hadoop-mapreduce-client/hadoop-mapreduce-client-core U: hadoop-mapreduce-project/hadoop-mapreduce-client/hadoop-mapreduce-client-core
      Max memory used 227MB
      Powered by Apache Yetus http://yetus.apache.org
      Console output https://builds.apache.org/job/PreCommit-MAPREDUCE-Build/6117/console

      This message was automatically generated.

      Show
      hadoopqa Hadoop QA added a comment - -1 overall Vote Subsystem Runtime Comment 0 reexec 0m 15s docker + precommit patch detected. +1 @author 0m 0s The patch does not contain any @author tags. +1 test4tests 0m 0s The patch appears to include 1 new or modified test files. +1 mvninstall 3m 53s trunk passed +1 compile 0m 22s trunk passed with JDK v1.8.0_60 +1 compile 0m 22s trunk passed with JDK v1.7.0_79 +1 checkstyle 0m 13s trunk passed +1 mvneclipse 0m 16s trunk passed +1 findbugs 1m 10s trunk passed +1 javadoc 0m 28s trunk passed with JDK v1.8.0_60 +1 javadoc 0m 30s trunk passed with JDK v1.7.0_79 +1 mvninstall 0m 31s the patch passed +1 compile 0m 25s the patch passed with JDK v1.8.0_60 +1 javac 0m 25s the patch passed +1 compile 0m 26s the patch passed with JDK v1.7.0_79 +1 javac 0m 26s the patch passed +1 checkstyle 0m 14s the patch passed +1 mvneclipse 0m 16s the patch passed +1 whitespace 0m 0s Patch has no whitespace issues. +1 findbugs 1m 24s the patch passed +1 javadoc 0m 28s the patch passed with JDK v1.8.0_60 +1 javadoc 0m 31s the patch passed with JDK v1.7.0_79 +1 unit 1m 52s hadoop-mapreduce-client-core in the patch passed with JDK v1.8.0_60. +1 unit 2m 8s hadoop-mapreduce-client-core in the patch passed with JDK v1.7.0_79. -1 asflicense 0m 23s Patch generated 1 ASF License warnings. 17m 24s Subsystem Report/Notes Docker Client=1.7.1 Server=1.7.1 Image:test-patch-base-hadoop-date2015-11-05 JIRA Patch URL https://issues.apache.org/jira/secure/attachment/12770707/MAPREDUCE-6533.3.patch JIRA Issue MAPREDUCE-6533 Optional Tests asflicense javac javadoc mvninstall unit findbugs checkstyle compile uname Linux 29af941d9a12 3.13.0-36-lowlatency #63-Ubuntu SMP PREEMPT Wed Sep 3 21:56:12 UTC 2014 x86_64 x86_64 x86_64 GNU/Linux Build tool maven Personality /home/jenkins/jenkins-slave/workspace/PreCommit-MAPREDUCE-Build/patchprocess/apache-yetus-e8bd3ad/precommit/personality/hadoop.sh git revision trunk / 5667129 Default Java 1.7.0_79 Multi-JDK versions /usr/lib/jvm/java-8-oracle:1.8.0_60 /usr/lib/jvm/java-7-openjdk-amd64:1.7.0_79 findbugs v3.0.0 JDK v1.7.0_79 Test Results https://builds.apache.org/job/PreCommit-MAPREDUCE-Build/6117/testReport/ asflicense https://builds.apache.org/job/PreCommit-MAPREDUCE-Build/6117/artifact/patchprocess/patch-asflicense-problems.txt modules C: hadoop-mapreduce-project/hadoop-mapreduce-client/hadoop-mapreduce-client-core U: hadoop-mapreduce-project/hadoop-mapreduce-client/hadoop-mapreduce-client-core Max memory used 227MB Powered by Apache Yetus http://yetus.apache.org Console output https://builds.apache.org/job/PreCommit-MAPREDUCE-Build/6117/console This message was automatically generated.
      Hide
      jlowe Jason Lowe added a comment -

      Thanks for updating the patch! Looks good except for something I just noticed – the test is trying to change the permissions of the root directory, and that could fall back to a very public place like /tmp. The test build directory should not be manipulated directly. Looks like there needs to be another directory level added if the permissions really need to be modified on the visibility directory's parent.

      Show
      jlowe Jason Lowe added a comment - Thanks for updating the patch! Looks good except for something I just noticed – the test is trying to change the permissions of the root directory, and that could fall back to a very public place like /tmp. The test build directory should not be manipulated directly. Looks like there needs to be another directory level added if the permissions really need to be modified on the visibility directory's parent.
      Hide
      lichangleo Chang Li added a comment -

      Thanks Jason Lowe for further review! update .4 patch to address your concern

      Show
      lichangleo Chang Li added a comment - Thanks Jason Lowe for further review! update .4 patch to address your concern
      Hide
      hadoopqa Hadoop QA added a comment -
      -1 overall



      Vote Subsystem Runtime Comment
      0 reexec 0m 6s docker + precommit patch detected.
      +1 @author 0m 0s The patch does not contain any @author tags.
      +1 test4tests 0m 0s The patch appears to include 1 new or modified test files.
      +1 mvninstall 3m 14s trunk passed
      +1 compile 0m 17s trunk passed with JDK v1.8.0_60
      +1 compile 0m 20s trunk passed with JDK v1.7.0_79
      +1 checkstyle 0m 11s trunk passed
      +1 mvneclipse 0m 14s trunk passed
      +1 findbugs 1m 3s trunk passed
      +1 javadoc 0m 21s trunk passed with JDK v1.8.0_60
      +1 javadoc 0m 25s trunk passed with JDK v1.7.0_79
      +1 mvninstall 0m 25s the patch passed
      +1 compile 0m 17s the patch passed with JDK v1.8.0_60
      +1 javac 0m 17s the patch passed
      +1 compile 0m 20s the patch passed with JDK v1.7.0_79
      +1 javac 0m 20s the patch passed
      +1 checkstyle 0m 11s the patch passed
      +1 mvneclipse 0m 15s the patch passed
      +1 whitespace 0m 0s Patch has no whitespace issues.
      +1 findbugs 1m 14s the patch passed
      +1 javadoc 0m 22s the patch passed with JDK v1.8.0_60
      +1 javadoc 0m 24s the patch passed with JDK v1.7.0_79
      +1 unit 1m 31s hadoop-mapreduce-client-core in the patch passed with JDK v1.8.0_60.
      +1 unit 1m 54s hadoop-mapreduce-client-core in the patch passed with JDK v1.7.0_79.
      -1 asflicense 0m 20s Patch generated 1 ASF License warnings.
      14m 25s



      Subsystem Report/Notes
      Docker Client=1.7.1 Server=1.7.1 Image:test-patch-base-hadoop-date2015-11-10
      JIRA Patch URL https://issues.apache.org/jira/secure/attachment/12771564/MAPREDUCE-6533.4.patch
      JIRA Issue MAPREDUCE-6533
      Optional Tests asflicense javac javadoc mvninstall unit findbugs checkstyle compile
      uname Linux 21dec59acb2b 3.13.0-36-lowlatency #63-Ubuntu SMP PREEMPT Wed Sep 3 21:56:12 UTC 2014 x86_64 x86_64 x86_64 GNU/Linux
      Build tool maven
      Personality /home/jenkins/jenkins-slave/workspace/PreCommit-MAPREDUCE-Build/patchprocess/apache-yetus-ee5baeb/precommit/personality/hadoop.sh
      git revision trunk / 0eb9c60
      Default Java 1.7.0_79
      Multi-JDK versions /usr/lib/jvm/java-8-oracle:1.8.0_60 /usr/lib/jvm/java-7-openjdk-amd64:1.7.0_79
      findbugs v3.0.0
      JDK v1.7.0_79 Test Results https://builds.apache.org/job/PreCommit-MAPREDUCE-Build/6137/testReport/
      asflicense https://builds.apache.org/job/PreCommit-MAPREDUCE-Build/6137/artifact/patchprocess/patch-asflicense-problems.txt
      modules C: hadoop-mapreduce-project/hadoop-mapreduce-client/hadoop-mapreduce-client-core U: hadoop-mapreduce-project/hadoop-mapreduce-client/hadoop-mapreduce-client-core
      Max memory used 228MB
      Powered by Apache Yetus http://yetus.apache.org
      Console output https://builds.apache.org/job/PreCommit-MAPREDUCE-Build/6137/console

      This message was automatically generated.

      Show
      hadoopqa Hadoop QA added a comment - -1 overall Vote Subsystem Runtime Comment 0 reexec 0m 6s docker + precommit patch detected. +1 @author 0m 0s The patch does not contain any @author tags. +1 test4tests 0m 0s The patch appears to include 1 new or modified test files. +1 mvninstall 3m 14s trunk passed +1 compile 0m 17s trunk passed with JDK v1.8.0_60 +1 compile 0m 20s trunk passed with JDK v1.7.0_79 +1 checkstyle 0m 11s trunk passed +1 mvneclipse 0m 14s trunk passed +1 findbugs 1m 3s trunk passed +1 javadoc 0m 21s trunk passed with JDK v1.8.0_60 +1 javadoc 0m 25s trunk passed with JDK v1.7.0_79 +1 mvninstall 0m 25s the patch passed +1 compile 0m 17s the patch passed with JDK v1.8.0_60 +1 javac 0m 17s the patch passed +1 compile 0m 20s the patch passed with JDK v1.7.0_79 +1 javac 0m 20s the patch passed +1 checkstyle 0m 11s the patch passed +1 mvneclipse 0m 15s the patch passed +1 whitespace 0m 0s Patch has no whitespace issues. +1 findbugs 1m 14s the patch passed +1 javadoc 0m 22s the patch passed with JDK v1.8.0_60 +1 javadoc 0m 24s the patch passed with JDK v1.7.0_79 +1 unit 1m 31s hadoop-mapreduce-client-core in the patch passed with JDK v1.8.0_60. +1 unit 1m 54s hadoop-mapreduce-client-core in the patch passed with JDK v1.7.0_79. -1 asflicense 0m 20s Patch generated 1 ASF License warnings. 14m 25s Subsystem Report/Notes Docker Client=1.7.1 Server=1.7.1 Image:test-patch-base-hadoop-date2015-11-10 JIRA Patch URL https://issues.apache.org/jira/secure/attachment/12771564/MAPREDUCE-6533.4.patch JIRA Issue MAPREDUCE-6533 Optional Tests asflicense javac javadoc mvninstall unit findbugs checkstyle compile uname Linux 21dec59acb2b 3.13.0-36-lowlatency #63-Ubuntu SMP PREEMPT Wed Sep 3 21:56:12 UTC 2014 x86_64 x86_64 x86_64 GNU/Linux Build tool maven Personality /home/jenkins/jenkins-slave/workspace/PreCommit-MAPREDUCE-Build/patchprocess/apache-yetus-ee5baeb/precommit/personality/hadoop.sh git revision trunk / 0eb9c60 Default Java 1.7.0_79 Multi-JDK versions /usr/lib/jvm/java-8-oracle:1.8.0_60 /usr/lib/jvm/java-7-openjdk-amd64:1.7.0_79 findbugs v3.0.0 JDK v1.7.0_79 Test Results https://builds.apache.org/job/PreCommit-MAPREDUCE-Build/6137/testReport/ asflicense https://builds.apache.org/job/PreCommit-MAPREDUCE-Build/6137/artifact/patchprocess/patch-asflicense-problems.txt modules C: hadoop-mapreduce-project/hadoop-mapreduce-client/hadoop-mapreduce-client-core U: hadoop-mapreduce-project/hadoop-mapreduce-client/hadoop-mapreduce-client-core Max memory used 228MB Powered by Apache Yetus http://yetus.apache.org Console output https://builds.apache.org/job/PreCommit-MAPREDUCE-Build/6137/console This message was automatically generated.
      Hide
      djp Junping Du added a comment -

      The test failure for testDetermineCache() is quite annoying. Thanks Chang Li for working on it and Jason Lowe for reviewing it.
      v4 patch looks good in overall except one place:

      +  private static final Path TEST_ROOT_DIR =
      +      new Path(System.getProperty("test.build.data", "/tmp"));
      

      We should replace "/tmp" with System.getProperty("java.io.tmpdir") for tests to run smoothly in platform other than Linux.

      Show
      djp Junping Du added a comment - The test failure for testDetermineCache() is quite annoying. Thanks Chang Li for working on it and Jason Lowe for reviewing it. v4 patch looks good in overall except one place: + private static final Path TEST_ROOT_DIR = + new Path( System .getProperty( "test.build.data" , "/tmp" )); We should replace "/tmp" with System.getProperty("java.io.tmpdir") for tests to run smoothly in platform other than Linux.
      Hide
      lichangleo Chang Li added a comment -

      Thanks Junping Du for review! update .5 patch according to your suggestion

      Show
      lichangleo Chang Li added a comment - Thanks Junping Du for review! update .5 patch according to your suggestion
      Hide
      hadoopqa Hadoop QA added a comment -
      -1 overall



      Vote Subsystem Runtime Comment
      0 reexec 0m 6s docker + precommit patch detected.
      +1 @author 0m 0s The patch does not contain any @author tags.
      +1 test4tests 0m 0s The patch appears to include 1 new or modified test files.
      +1 mvninstall 3m 4s trunk passed
      +1 compile 0m 19s trunk passed with JDK v1.8.0_60
      +1 compile 0m 22s trunk passed with JDK v1.7.0_79
      +1 checkstyle 0m 12s trunk passed
      +1 mvneclipse 0m 14s trunk passed
      +1 findbugs 1m 8s trunk passed
      +1 javadoc 0m 23s trunk passed with JDK v1.8.0_60
      +1 javadoc 0m 26s trunk passed with JDK v1.7.0_79
      +1 mvninstall 0m 25s the patch passed
      +1 compile 0m 19s the patch passed with JDK v1.8.0_60
      +1 javac 0m 19s the patch passed
      +1 compile 0m 21s the patch passed with JDK v1.7.0_79
      +1 javac 0m 21s the patch passed
      +1 checkstyle 0m 12s the patch passed
      +1 mvneclipse 0m 15s the patch passed
      +1 whitespace 0m 0s Patch has no whitespace issues.
      +1 findbugs 1m 19s the patch passed
      +1 javadoc 0m 24s the patch passed with JDK v1.8.0_60
      +1 javadoc 0m 25s the patch passed with JDK v1.7.0_79
      +1 unit 1m 40s hadoop-mapreduce-client-core in the patch passed with JDK v1.8.0_60.
      +1 unit 2m 1s hadoop-mapreduce-client-core in the patch passed with JDK v1.7.0_79.
      -1 asflicense 0m 21s Patch generated 1 ASF License warnings.
      15m 0s



      Subsystem Report/Notes
      Docker Client=1.7.1 Server=1.7.1 Image:test-patch-base-hadoop-date2015-11-11
      JIRA Patch URL https://issues.apache.org/jira/secure/attachment/12771747/MAPREDUCE-6533.5.patch
      JIRA Issue MAPREDUCE-6533
      Optional Tests asflicense javac javadoc mvninstall unit findbugs checkstyle compile
      uname Linux a78d73c8bdbb 3.13.0-36-lowlatency #63-Ubuntu SMP PREEMPT Wed Sep 3 21:56:12 UTC 2014 x86_64 x86_64 x86_64 GNU/Linux
      Build tool maven
      Personality /home/jenkins/jenkins-slave/workspace/PreCommit-MAPREDUCE-Build/patchprocess/apache-yetus-ee5baeb/precommit/personality/hadoop.sh
      git revision trunk / 23d0db5
      Default Java 1.7.0_79
      Multi-JDK versions /usr/lib/jvm/java-8-oracle:1.8.0_60 /usr/lib/jvm/java-7-openjdk-amd64:1.7.0_79
      findbugs v3.0.0
      JDK v1.7.0_79 Test Results https://builds.apache.org/job/PreCommit-MAPREDUCE-Build/6144/testReport/
      asflicense https://builds.apache.org/job/PreCommit-MAPREDUCE-Build/6144/artifact/patchprocess/patch-asflicense-problems.txt
      modules C: hadoop-mapreduce-project/hadoop-mapreduce-client/hadoop-mapreduce-client-core U: hadoop-mapreduce-project/hadoop-mapreduce-client/hadoop-mapreduce-client-core
      Max memory used 227MB
      Powered by Apache Yetus http://yetus.apache.org
      Console output https://builds.apache.org/job/PreCommit-MAPREDUCE-Build/6144/console

      This message was automatically generated.

      Show
      hadoopqa Hadoop QA added a comment - -1 overall Vote Subsystem Runtime Comment 0 reexec 0m 6s docker + precommit patch detected. +1 @author 0m 0s The patch does not contain any @author tags. +1 test4tests 0m 0s The patch appears to include 1 new or modified test files. +1 mvninstall 3m 4s trunk passed +1 compile 0m 19s trunk passed with JDK v1.8.0_60 +1 compile 0m 22s trunk passed with JDK v1.7.0_79 +1 checkstyle 0m 12s trunk passed +1 mvneclipse 0m 14s trunk passed +1 findbugs 1m 8s trunk passed +1 javadoc 0m 23s trunk passed with JDK v1.8.0_60 +1 javadoc 0m 26s trunk passed with JDK v1.7.0_79 +1 mvninstall 0m 25s the patch passed +1 compile 0m 19s the patch passed with JDK v1.8.0_60 +1 javac 0m 19s the patch passed +1 compile 0m 21s the patch passed with JDK v1.7.0_79 +1 javac 0m 21s the patch passed +1 checkstyle 0m 12s the patch passed +1 mvneclipse 0m 15s the patch passed +1 whitespace 0m 0s Patch has no whitespace issues. +1 findbugs 1m 19s the patch passed +1 javadoc 0m 24s the patch passed with JDK v1.8.0_60 +1 javadoc 0m 25s the patch passed with JDK v1.7.0_79 +1 unit 1m 40s hadoop-mapreduce-client-core in the patch passed with JDK v1.8.0_60. +1 unit 2m 1s hadoop-mapreduce-client-core in the patch passed with JDK v1.7.0_79. -1 asflicense 0m 21s Patch generated 1 ASF License warnings. 15m 0s Subsystem Report/Notes Docker Client=1.7.1 Server=1.7.1 Image:test-patch-base-hadoop-date2015-11-11 JIRA Patch URL https://issues.apache.org/jira/secure/attachment/12771747/MAPREDUCE-6533.5.patch JIRA Issue MAPREDUCE-6533 Optional Tests asflicense javac javadoc mvninstall unit findbugs checkstyle compile uname Linux a78d73c8bdbb 3.13.0-36-lowlatency #63-Ubuntu SMP PREEMPT Wed Sep 3 21:56:12 UTC 2014 x86_64 x86_64 x86_64 GNU/Linux Build tool maven Personality /home/jenkins/jenkins-slave/workspace/PreCommit-MAPREDUCE-Build/patchprocess/apache-yetus-ee5baeb/precommit/personality/hadoop.sh git revision trunk / 23d0db5 Default Java 1.7.0_79 Multi-JDK versions /usr/lib/jvm/java-8-oracle:1.8.0_60 /usr/lib/jvm/java-7-openjdk-amd64:1.7.0_79 findbugs v3.0.0 JDK v1.7.0_79 Test Results https://builds.apache.org/job/PreCommit-MAPREDUCE-Build/6144/testReport/ asflicense https://builds.apache.org/job/PreCommit-MAPREDUCE-Build/6144/artifact/patchprocess/patch-asflicense-problems.txt modules C: hadoop-mapreduce-project/hadoop-mapreduce-client/hadoop-mapreduce-client-core U: hadoop-mapreduce-project/hadoop-mapreduce-client/hadoop-mapreduce-client-core Max memory used 227MB Powered by Apache Yetus http://yetus.apache.org Console output https://builds.apache.org/job/PreCommit-MAPREDUCE-Build/6144/console This message was automatically generated.
      Hide
      jlowe Jason Lowe added a comment -

      The root directory should be the parent rather than a new parent, that way we're not scribbling random files in a directory shared by other things and other tests. TEST_ROOT_DIR should be something like this:

        private static final Path TEST_ROOT_DIR = new Path(
            System.getProperty("test.build.data",
                System.getProperty("java.io.tmpdir")),
            TestClientDistributedCacheManager.class.getSimpleName());
      

      And then the tearDown function can simply call FileUtil.fullyDelete(TEST_ROOT_DIR) rather than cleaning up individual files and having to maintain the list of potential things that could be leaked there.

      Show
      jlowe Jason Lowe added a comment - The root directory should be the parent rather than a new parent, that way we're not scribbling random files in a directory shared by other things and other tests. TEST_ROOT_DIR should be something like this: private static final Path TEST_ROOT_DIR = new Path( System .getProperty( "test.build.data" , System .getProperty( "java.io.tmpdir" )), TestClientDistributedCacheManager.class.getSimpleName()); And then the tearDown function can simply call FileUtil.fullyDelete(TEST_ROOT_DIR) rather than cleaning up individual files and having to maintain the list of potential things that could be leaked there.
      Hide
      lichangleo Chang Li added a comment -

      Thanks Jason Lowe for further review! update .6 patch accordingly

      Show
      lichangleo Chang Li added a comment - Thanks Jason Lowe for further review! update .6 patch accordingly
      Hide
      lichangleo Chang Li added a comment -

      sorry, over look the comment about tearDown part. will fix that

      Show
      lichangleo Chang Li added a comment - sorry, over look the comment about tearDown part. will fix that
      Hide
      hadoopqa Hadoop QA added a comment -
      -1 overall



      Vote Subsystem Runtime Comment
      0 reexec 0m 10s docker + precommit patch detected.
      +1 @author 0m 0s The patch does not contain any @author tags.
      +1 test4tests 0m 0s The patch appears to include 1 new or modified test files.
      +1 mvninstall 3m 41s trunk passed
      +1 compile 0m 26s trunk passed with JDK v1.8.0_66
      +1 compile 0m 25s trunk passed with JDK v1.7.0_79
      +1 checkstyle 0m 14s trunk passed
      +1 mvneclipse 0m 15s trunk passed
      +1 findbugs 1m 18s trunk passed
      +1 javadoc 0m 28s trunk passed with JDK v1.8.0_66
      +1 javadoc 0m 28s trunk passed with JDK v1.7.0_79
      +1 mvninstall 0m 28s the patch passed
      +1 compile 0m 25s the patch passed with JDK v1.8.0_66
      +1 javac 0m 25s the patch passed
      +1 compile 0m 25s the patch passed with JDK v1.7.0_79
      +1 javac 0m 25s the patch passed
      +1 checkstyle 0m 15s the patch passed
      +1 mvneclipse 0m 16s the patch passed
      +1 whitespace 0m 0s Patch has no whitespace issues.
      +1 findbugs 1m 32s the patch passed
      +1 javadoc 0m 33s the patch passed with JDK v1.8.0_66
      +1 javadoc 0m 32s the patch passed with JDK v1.7.0_79
      +1 unit 2m 5s hadoop-mapreduce-client-core in the patch passed with JDK v1.8.0_66.
      +1 unit 2m 16s hadoop-mapreduce-client-core in the patch passed with JDK v1.7.0_79.
      -1 asflicense 0m 27s Patch generated 1 ASF License warnings.
      17m 49s



      Subsystem Report/Notes
      Docker Client=1.7.0 Server=1.7.0 Image:test-patch-base-hadoop-date2015-11-11
      JIRA Patch URL https://issues.apache.org/jira/secure/attachment/12771763/MAPREDUCE-6533.6.patch
      JIRA Issue MAPREDUCE-6533
      Optional Tests asflicense javac javadoc mvninstall unit findbugs checkstyle compile
      uname Linux 8b63d98249e0 3.13.0-36-lowlatency #63-Ubuntu SMP PREEMPT Wed Sep 3 21:56:12 UTC 2014 x86_64 x86_64 x86_64 GNU/Linux
      Build tool maven
      Personality /home/jenkins/jenkins-slave/workspace/PreCommit-MAPREDUCE-Build/patchprocess/apache-yetus-ee5baeb/precommit/personality/hadoop.sh
      git revision trunk / d907697
      Default Java 1.7.0_79
      Multi-JDK versions /usr/lib/jvm/java-8-oracle:1.8.0_66 /usr/lib/jvm/java-7-openjdk-amd64:1.7.0_79
      findbugs v3.0.0
      JDK v1.7.0_79 Test Results https://builds.apache.org/job/PreCommit-MAPREDUCE-Build/6147/testReport/
      asflicense https://builds.apache.org/job/PreCommit-MAPREDUCE-Build/6147/artifact/patchprocess/patch-asflicense-problems.txt
      modules C: hadoop-mapreduce-project/hadoop-mapreduce-client/hadoop-mapreduce-client-core U: hadoop-mapreduce-project/hadoop-mapreduce-client/hadoop-mapreduce-client-core
      Max memory used 226MB
      Powered by Apache Yetus http://yetus.apache.org
      Console output https://builds.apache.org/job/PreCommit-MAPREDUCE-Build/6147/console

      This message was automatically generated.

      Show
      hadoopqa Hadoop QA added a comment - -1 overall Vote Subsystem Runtime Comment 0 reexec 0m 10s docker + precommit patch detected. +1 @author 0m 0s The patch does not contain any @author tags. +1 test4tests 0m 0s The patch appears to include 1 new or modified test files. +1 mvninstall 3m 41s trunk passed +1 compile 0m 26s trunk passed with JDK v1.8.0_66 +1 compile 0m 25s trunk passed with JDK v1.7.0_79 +1 checkstyle 0m 14s trunk passed +1 mvneclipse 0m 15s trunk passed +1 findbugs 1m 18s trunk passed +1 javadoc 0m 28s trunk passed with JDK v1.8.0_66 +1 javadoc 0m 28s trunk passed with JDK v1.7.0_79 +1 mvninstall 0m 28s the patch passed +1 compile 0m 25s the patch passed with JDK v1.8.0_66 +1 javac 0m 25s the patch passed +1 compile 0m 25s the patch passed with JDK v1.7.0_79 +1 javac 0m 25s the patch passed +1 checkstyle 0m 15s the patch passed +1 mvneclipse 0m 16s the patch passed +1 whitespace 0m 0s Patch has no whitespace issues. +1 findbugs 1m 32s the patch passed +1 javadoc 0m 33s the patch passed with JDK v1.8.0_66 +1 javadoc 0m 32s the patch passed with JDK v1.7.0_79 +1 unit 2m 5s hadoop-mapreduce-client-core in the patch passed with JDK v1.8.0_66. +1 unit 2m 16s hadoop-mapreduce-client-core in the patch passed with JDK v1.7.0_79. -1 asflicense 0m 27s Patch generated 1 ASF License warnings. 17m 49s Subsystem Report/Notes Docker Client=1.7.0 Server=1.7.0 Image:test-patch-base-hadoop-date2015-11-11 JIRA Patch URL https://issues.apache.org/jira/secure/attachment/12771763/MAPREDUCE-6533.6.patch JIRA Issue MAPREDUCE-6533 Optional Tests asflicense javac javadoc mvninstall unit findbugs checkstyle compile uname Linux 8b63d98249e0 3.13.0-36-lowlatency #63-Ubuntu SMP PREEMPT Wed Sep 3 21:56:12 UTC 2014 x86_64 x86_64 x86_64 GNU/Linux Build tool maven Personality /home/jenkins/jenkins-slave/workspace/PreCommit-MAPREDUCE-Build/patchprocess/apache-yetus-ee5baeb/precommit/personality/hadoop.sh git revision trunk / d907697 Default Java 1.7.0_79 Multi-JDK versions /usr/lib/jvm/java-8-oracle:1.8.0_66 /usr/lib/jvm/java-7-openjdk-amd64:1.7.0_79 findbugs v3.0.0 JDK v1.7.0_79 Test Results https://builds.apache.org/job/PreCommit-MAPREDUCE-Build/6147/testReport/ asflicense https://builds.apache.org/job/PreCommit-MAPREDUCE-Build/6147/artifact/patchprocess/patch-asflicense-problems.txt modules C: hadoop-mapreduce-project/hadoop-mapreduce-client/hadoop-mapreduce-client-core U: hadoop-mapreduce-project/hadoop-mapreduce-client/hadoop-mapreduce-client-core Max memory used 226MB Powered by Apache Yetus http://yetus.apache.org Console output https://builds.apache.org/job/PreCommit-MAPREDUCE-Build/6147/console This message was automatically generated.
      Hide
      lichangleo Chang Li added a comment -

      .6.2 fix tear down as well

      Show
      lichangleo Chang Li added a comment - .6.2 fix tear down as well
      Hide
      jlowe Jason Lowe added a comment -

      Argh sorry, my bad. FileUtil is OK and will work, but it would be cleaner to simply do a fs.delete(TEST_ROOT_DIR, true) to do the cleanup. Then we don't need the FileUtil dependency. Patch looks good otherwise.

      Show
      jlowe Jason Lowe added a comment - Argh sorry, my bad. FileUtil is OK and will work, but it would be cleaner to simply do a fs.delete(TEST_ROOT_DIR, true) to do the cleanup. Then we don't need the FileUtil dependency. Patch looks good otherwise.
      Hide
      lichangleo Chang Li added a comment -

      Thanks for very patient and careful review Jason Lowe! update .6.3 patch accordingly

      Show
      lichangleo Chang Li added a comment - Thanks for very patient and careful review Jason Lowe ! update .6.3 patch accordingly
      Hide
      hadoopqa Hadoop QA added a comment -
      -1 overall



      Vote Subsystem Runtime Comment
      0 reexec 0m 8s docker + precommit patch detected.
      +1 @author 0m 0s The patch does not contain any @author tags.
      +1 test4tests 0m 0s The patch appears to include 1 new or modified test files.
      +1 mvninstall 3m 14s trunk passed
      +1 compile 0m 19s trunk passed with JDK v1.8.0_66
      +1 compile 0m 20s trunk passed with JDK v1.7.0_85
      +1 checkstyle 0m 12s trunk passed
      +1 mvneclipse 0m 14s trunk passed
      +1 findbugs 1m 8s trunk passed
      +1 javadoc 0m 22s trunk passed with JDK v1.8.0_66
      +1 javadoc 0m 26s trunk passed with JDK v1.7.0_85
      +1 mvninstall 0m 22s the patch passed
      +1 compile 0m 18s the patch passed with JDK v1.8.0_66
      +1 javac 0m 18s the patch passed
      +1 compile 0m 20s the patch passed with JDK v1.7.0_85
      +1 javac 0m 20s the patch passed
      +1 checkstyle 0m 12s the patch passed
      +1 mvneclipse 0m 14s the patch passed
      +1 whitespace 0m 0s Patch has no whitespace issues.
      +1 findbugs 1m 15s the patch passed
      +1 javadoc 0m 21s the patch passed with JDK v1.8.0_66
      +1 javadoc 0m 25s the patch passed with JDK v1.7.0_85
      +1 unit 1m 34s hadoop-mapreduce-client-core in the patch passed with JDK v1.8.0_66.
      +1 unit 1m 52s hadoop-mapreduce-client-core in the patch passed with JDK v1.7.0_85.
      -1 asflicense 0m 20s Patch generated 1 ASF License warnings.
      14m 33s



      Subsystem Report/Notes
      Docker Client=1.7.1 Server=1.7.1 Image:test-patch-base-hadoop-date2015-11-11
      JIRA Patch URL https://issues.apache.org/jira/secure/attachment/12771768/MAPREDUCE-6533.6.2.patch
      JIRA Issue MAPREDUCE-6533
      Optional Tests asflicense javac javadoc mvninstall unit findbugs checkstyle compile
      uname Linux 983b103da4b2 3.13.0-36-lowlatency #63-Ubuntu SMP PREEMPT Wed Sep 3 21:56:12 UTC 2014 x86_64 x86_64 x86_64 GNU/Linux
      Build tool maven
      Personality /home/jenkins/jenkins-slave/workspace/PreCommit-MAPREDUCE-Build/patchprocess/apache-yetus-ee5baeb/precommit/personality/hadoop.sh
      git revision trunk / d907697
      Default Java 1.7.0_85
      Multi-JDK versions /usr/lib/jvm/java-8-oracle:1.8.0_66 /usr/lib/jvm/java-7-openjdk-amd64:1.7.0_85
      findbugs v3.0.0
      JDK v1.7.0_85 Test Results https://builds.apache.org/job/PreCommit-MAPREDUCE-Build/6149/testReport/
      asflicense https://builds.apache.org/job/PreCommit-MAPREDUCE-Build/6149/artifact/patchprocess/patch-asflicense-problems.txt
      modules C: hadoop-mapreduce-project/hadoop-mapreduce-client/hadoop-mapreduce-client-core U: hadoop-mapreduce-project/hadoop-mapreduce-client/hadoop-mapreduce-client-core
      Max memory used 225MB
      Powered by Apache Yetus http://yetus.apache.org
      Console output https://builds.apache.org/job/PreCommit-MAPREDUCE-Build/6149/console

      This message was automatically generated.

      Show
      hadoopqa Hadoop QA added a comment - -1 overall Vote Subsystem Runtime Comment 0 reexec 0m 8s docker + precommit patch detected. +1 @author 0m 0s The patch does not contain any @author tags. +1 test4tests 0m 0s The patch appears to include 1 new or modified test files. +1 mvninstall 3m 14s trunk passed +1 compile 0m 19s trunk passed with JDK v1.8.0_66 +1 compile 0m 20s trunk passed with JDK v1.7.0_85 +1 checkstyle 0m 12s trunk passed +1 mvneclipse 0m 14s trunk passed +1 findbugs 1m 8s trunk passed +1 javadoc 0m 22s trunk passed with JDK v1.8.0_66 +1 javadoc 0m 26s trunk passed with JDK v1.7.0_85 +1 mvninstall 0m 22s the patch passed +1 compile 0m 18s the patch passed with JDK v1.8.0_66 +1 javac 0m 18s the patch passed +1 compile 0m 20s the patch passed with JDK v1.7.0_85 +1 javac 0m 20s the patch passed +1 checkstyle 0m 12s the patch passed +1 mvneclipse 0m 14s the patch passed +1 whitespace 0m 0s Patch has no whitespace issues. +1 findbugs 1m 15s the patch passed +1 javadoc 0m 21s the patch passed with JDK v1.8.0_66 +1 javadoc 0m 25s the patch passed with JDK v1.7.0_85 +1 unit 1m 34s hadoop-mapreduce-client-core in the patch passed with JDK v1.8.0_66. +1 unit 1m 52s hadoop-mapreduce-client-core in the patch passed with JDK v1.7.0_85. -1 asflicense 0m 20s Patch generated 1 ASF License warnings. 14m 33s Subsystem Report/Notes Docker Client=1.7.1 Server=1.7.1 Image:test-patch-base-hadoop-date2015-11-11 JIRA Patch URL https://issues.apache.org/jira/secure/attachment/12771768/MAPREDUCE-6533.6.2.patch JIRA Issue MAPREDUCE-6533 Optional Tests asflicense javac javadoc mvninstall unit findbugs checkstyle compile uname Linux 983b103da4b2 3.13.0-36-lowlatency #63-Ubuntu SMP PREEMPT Wed Sep 3 21:56:12 UTC 2014 x86_64 x86_64 x86_64 GNU/Linux Build tool maven Personality /home/jenkins/jenkins-slave/workspace/PreCommit-MAPREDUCE-Build/patchprocess/apache-yetus-ee5baeb/precommit/personality/hadoop.sh git revision trunk / d907697 Default Java 1.7.0_85 Multi-JDK versions /usr/lib/jvm/java-8-oracle:1.8.0_66 /usr/lib/jvm/java-7-openjdk-amd64:1.7.0_85 findbugs v3.0.0 JDK v1.7.0_85 Test Results https://builds.apache.org/job/PreCommit-MAPREDUCE-Build/6149/testReport/ asflicense https://builds.apache.org/job/PreCommit-MAPREDUCE-Build/6149/artifact/patchprocess/patch-asflicense-problems.txt modules C: hadoop-mapreduce-project/hadoop-mapreduce-client/hadoop-mapreduce-client-core U: hadoop-mapreduce-project/hadoop-mapreduce-client/hadoop-mapreduce-client-core Max memory used 225MB Powered by Apache Yetus http://yetus.apache.org Console output https://builds.apache.org/job/PreCommit-MAPREDUCE-Build/6149/console This message was automatically generated.
      Hide
      hadoopqa Hadoop QA added a comment -
      -1 overall



      Vote Subsystem Runtime Comment
      0 reexec 0m 6s docker + precommit patch detected.
      +1 @author 0m 0s The patch does not contain any @author tags.
      +1 test4tests 0m 0s The patch appears to include 1 new or modified test files.
      +1 mvninstall 3m 1s trunk passed
      +1 compile 0m 17s trunk passed with JDK v1.8.0_60
      +1 compile 0m 20s trunk passed with JDK v1.7.0_79
      +1 checkstyle 0m 11s trunk passed
      +1 mvneclipse 0m 14s trunk passed
      +1 findbugs 1m 6s trunk passed
      +1 javadoc 0m 21s trunk passed with JDK v1.8.0_60
      +1 javadoc 0m 23s trunk passed with JDK v1.7.0_79
      +1 mvninstall 0m 25s the patch passed
      +1 compile 0m 17s the patch passed with JDK v1.8.0_60
      +1 javac 0m 17s the patch passed
      +1 compile 0m 21s the patch passed with JDK v1.7.0_79
      +1 javac 0m 21s the patch passed
      +1 checkstyle 0m 11s the patch passed
      +1 mvneclipse 0m 14s the patch passed
      +1 whitespace 0m 0s Patch has no whitespace issues.
      +1 findbugs 1m 15s the patch passed
      +1 javadoc 0m 22s the patch passed with JDK v1.8.0_60
      +1 javadoc 0m 23s the patch passed with JDK v1.7.0_79
      +1 unit 1m 30s hadoop-mapreduce-client-core in the patch passed with JDK v1.8.0_60.
      +1 unit 1m 52s hadoop-mapreduce-client-core in the patch passed with JDK v1.7.0_79.
      -1 asflicense 0m 20s Patch generated 1 ASF License warnings.
      14m 10s



      Subsystem Report/Notes
      Docker Client=1.7.1 Server=1.7.1 Image:test-patch-base-hadoop-date2015-11-11
      JIRA Patch URL https://issues.apache.org/jira/secure/attachment/12771772/MAPREDUCE-6533.6.3.patch
      JIRA Issue MAPREDUCE-6533
      Optional Tests asflicense javac javadoc mvninstall unit findbugs checkstyle compile
      uname Linux 4c99bb76a571 3.13.0-36-lowlatency #63-Ubuntu SMP PREEMPT Wed Sep 3 21:56:12 UTC 2014 x86_64 x86_64 x86_64 GNU/Linux
      Build tool maven
      Personality /home/jenkins/jenkins-slave/workspace/PreCommit-MAPREDUCE-Build/patchprocess/apache-yetus-ee5baeb/precommit/personality/hadoop.sh
      git revision trunk / d907697
      Default Java 1.7.0_79
      Multi-JDK versions /usr/lib/jvm/java-8-oracle:1.8.0_60 /usr/lib/jvm/java-7-openjdk-amd64:1.7.0_79
      findbugs v3.0.0
      JDK v1.7.0_79 Test Results https://builds.apache.org/job/PreCommit-MAPREDUCE-Build/6150/testReport/
      asflicense https://builds.apache.org/job/PreCommit-MAPREDUCE-Build/6150/artifact/patchprocess/patch-asflicense-problems.txt
      modules C: hadoop-mapreduce-project/hadoop-mapreduce-client/hadoop-mapreduce-client-core U: hadoop-mapreduce-project/hadoop-mapreduce-client/hadoop-mapreduce-client-core
      Max memory used 227MB
      Powered by Apache Yetus http://yetus.apache.org
      Console output https://builds.apache.org/job/PreCommit-MAPREDUCE-Build/6150/console

      This message was automatically generated.

      Show
      hadoopqa Hadoop QA added a comment - -1 overall Vote Subsystem Runtime Comment 0 reexec 0m 6s docker + precommit patch detected. +1 @author 0m 0s The patch does not contain any @author tags. +1 test4tests 0m 0s The patch appears to include 1 new or modified test files. +1 mvninstall 3m 1s trunk passed +1 compile 0m 17s trunk passed with JDK v1.8.0_60 +1 compile 0m 20s trunk passed with JDK v1.7.0_79 +1 checkstyle 0m 11s trunk passed +1 mvneclipse 0m 14s trunk passed +1 findbugs 1m 6s trunk passed +1 javadoc 0m 21s trunk passed with JDK v1.8.0_60 +1 javadoc 0m 23s trunk passed with JDK v1.7.0_79 +1 mvninstall 0m 25s the patch passed +1 compile 0m 17s the patch passed with JDK v1.8.0_60 +1 javac 0m 17s the patch passed +1 compile 0m 21s the patch passed with JDK v1.7.0_79 +1 javac 0m 21s the patch passed +1 checkstyle 0m 11s the patch passed +1 mvneclipse 0m 14s the patch passed +1 whitespace 0m 0s Patch has no whitespace issues. +1 findbugs 1m 15s the patch passed +1 javadoc 0m 22s the patch passed with JDK v1.8.0_60 +1 javadoc 0m 23s the patch passed with JDK v1.7.0_79 +1 unit 1m 30s hadoop-mapreduce-client-core in the patch passed with JDK v1.8.0_60. +1 unit 1m 52s hadoop-mapreduce-client-core in the patch passed with JDK v1.7.0_79. -1 asflicense 0m 20s Patch generated 1 ASF License warnings. 14m 10s Subsystem Report/Notes Docker Client=1.7.1 Server=1.7.1 Image:test-patch-base-hadoop-date2015-11-11 JIRA Patch URL https://issues.apache.org/jira/secure/attachment/12771772/MAPREDUCE-6533.6.3.patch JIRA Issue MAPREDUCE-6533 Optional Tests asflicense javac javadoc mvninstall unit findbugs checkstyle compile uname Linux 4c99bb76a571 3.13.0-36-lowlatency #63-Ubuntu SMP PREEMPT Wed Sep 3 21:56:12 UTC 2014 x86_64 x86_64 x86_64 GNU/Linux Build tool maven Personality /home/jenkins/jenkins-slave/workspace/PreCommit-MAPREDUCE-Build/patchprocess/apache-yetus-ee5baeb/precommit/personality/hadoop.sh git revision trunk / d907697 Default Java 1.7.0_79 Multi-JDK versions /usr/lib/jvm/java-8-oracle:1.8.0_60 /usr/lib/jvm/java-7-openjdk-amd64:1.7.0_79 findbugs v3.0.0 JDK v1.7.0_79 Test Results https://builds.apache.org/job/PreCommit-MAPREDUCE-Build/6150/testReport/ asflicense https://builds.apache.org/job/PreCommit-MAPREDUCE-Build/6150/artifact/patchprocess/patch-asflicense-problems.txt modules C: hadoop-mapreduce-project/hadoop-mapreduce-client/hadoop-mapreduce-client-core U: hadoop-mapreduce-project/hadoop-mapreduce-client/hadoop-mapreduce-client-core Max memory used 227MB Powered by Apache Yetus http://yetus.apache.org Console output https://builds.apache.org/job/PreCommit-MAPREDUCE-Build/6150/console This message was automatically generated.
      Hide
      jlowe Jason Lowe added a comment -

      +1, committing this.

      Show
      jlowe Jason Lowe added a comment - +1, committing this.
      Hide
      jlowe Jason Lowe added a comment -

      Thanks to Chang for the contribution and to Junping for additional review! I committed this to trunk and branch-2.

      Show
      jlowe Jason Lowe added a comment - Thanks to Chang for the contribution and to Junping for additional review! I committed this to trunk and branch-2.
      Hide
      hudson Hudson added a comment -

      FAILURE: Integrated in Hadoop-trunk-Commit #8792 (See https://builds.apache.org/job/Hadoop-trunk-Commit/8792/)
      MAPREDUCE-6533. testDetermineCacheVisibilities of (jlowe: rev df68eac825c2b64b2b2dc2193134afaf2a1d9076)

      • hadoop-mapreduce-project/CHANGES.txt
      • hadoop-mapreduce-project/hadoop-mapreduce-client/hadoop-mapreduce-client-core/src/test/java/org/apache/hadoop/mapreduce/filecache/TestClientDistributedCacheManager.java
      Show
      hudson Hudson added a comment - FAILURE: Integrated in Hadoop-trunk-Commit #8792 (See https://builds.apache.org/job/Hadoop-trunk-Commit/8792/ ) MAPREDUCE-6533 . testDetermineCacheVisibilities of (jlowe: rev df68eac825c2b64b2b2dc2193134afaf2a1d9076) hadoop-mapreduce-project/CHANGES.txt hadoop-mapreduce-project/hadoop-mapreduce-client/hadoop-mapreduce-client-core/src/test/java/org/apache/hadoop/mapreduce/filecache/TestClientDistributedCacheManager.java
      Hide
      hudson Hudson added a comment -

      FAILURE: Integrated in Hadoop-Yarn-trunk-Java8 #669 (See https://builds.apache.org/job/Hadoop-Yarn-trunk-Java8/669/)
      MAPREDUCE-6533. testDetermineCacheVisibilities of (jlowe: rev df68eac825c2b64b2b2dc2193134afaf2a1d9076)

      • hadoop-mapreduce-project/CHANGES.txt
      • hadoop-mapreduce-project/hadoop-mapreduce-client/hadoop-mapreduce-client-core/src/test/java/org/apache/hadoop/mapreduce/filecache/TestClientDistributedCacheManager.java
      Show
      hudson Hudson added a comment - FAILURE: Integrated in Hadoop-Yarn-trunk-Java8 #669 (See https://builds.apache.org/job/Hadoop-Yarn-trunk-Java8/669/ ) MAPREDUCE-6533 . testDetermineCacheVisibilities of (jlowe: rev df68eac825c2b64b2b2dc2193134afaf2a1d9076) hadoop-mapreduce-project/CHANGES.txt hadoop-mapreduce-project/hadoop-mapreduce-client/hadoop-mapreduce-client-core/src/test/java/org/apache/hadoop/mapreduce/filecache/TestClientDistributedCacheManager.java
      Hide
      hudson Hudson added a comment -

      FAILURE: Integrated in Hadoop-Mapreduce-trunk #2597 (See https://builds.apache.org/job/Hadoop-Mapreduce-trunk/2597/)
      MAPREDUCE-6533. testDetermineCacheVisibilities of (jlowe: rev df68eac825c2b64b2b2dc2193134afaf2a1d9076)

      • hadoop-mapreduce-project/hadoop-mapreduce-client/hadoop-mapreduce-client-core/src/test/java/org/apache/hadoop/mapreduce/filecache/TestClientDistributedCacheManager.java
      • hadoop-mapreduce-project/CHANGES.txt
      Show
      hudson Hudson added a comment - FAILURE: Integrated in Hadoop-Mapreduce-trunk #2597 (See https://builds.apache.org/job/Hadoop-Mapreduce-trunk/2597/ ) MAPREDUCE-6533 . testDetermineCacheVisibilities of (jlowe: rev df68eac825c2b64b2b2dc2193134afaf2a1d9076) hadoop-mapreduce-project/hadoop-mapreduce-client/hadoop-mapreduce-client-core/src/test/java/org/apache/hadoop/mapreduce/filecache/TestClientDistributedCacheManager.java hadoop-mapreduce-project/CHANGES.txt
      Hide
      hudson Hudson added a comment -

      FAILURE: Integrated in Hadoop-Yarn-trunk #1393 (See https://builds.apache.org/job/Hadoop-Yarn-trunk/1393/)
      MAPREDUCE-6533. testDetermineCacheVisibilities of (jlowe: rev df68eac825c2b64b2b2dc2193134afaf2a1d9076)

      • hadoop-mapreduce-project/CHANGES.txt
      • hadoop-mapreduce-project/hadoop-mapreduce-client/hadoop-mapreduce-client-core/src/test/java/org/apache/hadoop/mapreduce/filecache/TestClientDistributedCacheManager.java
      Show
      hudson Hudson added a comment - FAILURE: Integrated in Hadoop-Yarn-trunk #1393 (See https://builds.apache.org/job/Hadoop-Yarn-trunk/1393/ ) MAPREDUCE-6533 . testDetermineCacheVisibilities of (jlowe: rev df68eac825c2b64b2b2dc2193134afaf2a1d9076) hadoop-mapreduce-project/CHANGES.txt hadoop-mapreduce-project/hadoop-mapreduce-client/hadoop-mapreduce-client-core/src/test/java/org/apache/hadoop/mapreduce/filecache/TestClientDistributedCacheManager.java
      Hide
      hudson Hudson added a comment -

      FAILURE: Integrated in Hadoop-Mapreduce-trunk-Java8 #657 (See https://builds.apache.org/job/Hadoop-Mapreduce-trunk-Java8/657/)
      MAPREDUCE-6533. testDetermineCacheVisibilities of (jlowe: rev df68eac825c2b64b2b2dc2193134afaf2a1d9076)

      • hadoop-mapreduce-project/CHANGES.txt
      • hadoop-mapreduce-project/hadoop-mapreduce-client/hadoop-mapreduce-client-core/src/test/java/org/apache/hadoop/mapreduce/filecache/TestClientDistributedCacheManager.java
      Show
      hudson Hudson added a comment - FAILURE: Integrated in Hadoop-Mapreduce-trunk-Java8 #657 (See https://builds.apache.org/job/Hadoop-Mapreduce-trunk-Java8/657/ ) MAPREDUCE-6533 . testDetermineCacheVisibilities of (jlowe: rev df68eac825c2b64b2b2dc2193134afaf2a1d9076) hadoop-mapreduce-project/CHANGES.txt hadoop-mapreduce-project/hadoop-mapreduce-client/hadoop-mapreduce-client-core/src/test/java/org/apache/hadoop/mapreduce/filecache/TestClientDistributedCacheManager.java
      Hide
      hudson Hudson added a comment -

      ABORTED: Integrated in Hadoop-Hdfs-trunk-Java8 #597 (See https://builds.apache.org/job/Hadoop-Hdfs-trunk-Java8/597/)
      MAPREDUCE-6533. testDetermineCacheVisibilities of (jlowe: rev df68eac825c2b64b2b2dc2193134afaf2a1d9076)

      • hadoop-mapreduce-project/hadoop-mapreduce-client/hadoop-mapreduce-client-core/src/test/java/org/apache/hadoop/mapreduce/filecache/TestClientDistributedCacheManager.java
      • hadoop-mapreduce-project/CHANGES.txt
      Show
      hudson Hudson added a comment - ABORTED: Integrated in Hadoop-Hdfs-trunk-Java8 #597 (See https://builds.apache.org/job/Hadoop-Hdfs-trunk-Java8/597/ ) MAPREDUCE-6533 . testDetermineCacheVisibilities of (jlowe: rev df68eac825c2b64b2b2dc2193134afaf2a1d9076) hadoop-mapreduce-project/hadoop-mapreduce-client/hadoop-mapreduce-client-core/src/test/java/org/apache/hadoop/mapreduce/filecache/TestClientDistributedCacheManager.java hadoop-mapreduce-project/CHANGES.txt
      Hide
      hudson Hudson added a comment -

      FAILURE: Integrated in Hadoop-Hdfs-trunk #2536 (See https://builds.apache.org/job/Hadoop-Hdfs-trunk/2536/)
      MAPREDUCE-6533. testDetermineCacheVisibilities of (jlowe: rev df68eac825c2b64b2b2dc2193134afaf2a1d9076)

      • hadoop-mapreduce-project/hadoop-mapreduce-client/hadoop-mapreduce-client-core/src/test/java/org/apache/hadoop/mapreduce/filecache/TestClientDistributedCacheManager.java
      • hadoop-mapreduce-project/CHANGES.txt
      Show
      hudson Hudson added a comment - FAILURE: Integrated in Hadoop-Hdfs-trunk #2536 (See https://builds.apache.org/job/Hadoop-Hdfs-trunk/2536/ ) MAPREDUCE-6533 . testDetermineCacheVisibilities of (jlowe: rev df68eac825c2b64b2b2dc2193134afaf2a1d9076) hadoop-mapreduce-project/hadoop-mapreduce-client/hadoop-mapreduce-client-core/src/test/java/org/apache/hadoop/mapreduce/filecache/TestClientDistributedCacheManager.java hadoop-mapreduce-project/CHANGES.txt

        People

        • Assignee:
          lichangleo Chang Li
          Reporter:
          lichangleo Chang Li
        • Votes:
          0 Vote for this issue
          Watchers:
          5 Start watching this issue

          Dates

          • Created:
            Updated:
            Resolved:

            Development