Uploaded image for project: 'Hadoop Map/Reduce'
  1. Hadoop Map/Reduce
  2. MAPREDUCE-6356

Misspelling of threshold in log4j.properties for tests

    Details

    • Type: Bug
    • Status: Resolved
    • Priority: Minor
    • Resolution: Fixed
    • Affects Version/s: 2.7.0
    • Fix Version/s: 2.8.0, 3.0.0-alpha1
    • Component/s: test
    • Labels:
      None
    • Target Version/s:
    • Hadoop Flags:
      Reviewed

      Description

      log4j.properties file for test contains misspelling "log4j.threshhold".
      We should use "log4j.threshold" correctly.

      1. MAPREDUCE-6356.patch
        6 kB
        Brahma Reddy Battula
      2. MAPREDUCE-6356-002.patch
        7 kB
        Brahma Reddy Battula

        Issue Links

          Activity

          Hide
          brahmareddy Brahma Reddy Battula added a comment -

          Attached patch fix the typo in log4j.properties..

          Show
          brahmareddy Brahma Reddy Battula added a comment - Attached patch fix the typo in log4j.properties..
          Hide
          hadoopqa Hadoop QA added a comment -



          +1 overall



          Vote Subsystem Runtime Comment
          0 pre-patch 5m 15s Pre-patch trunk compilation is healthy.
          +1 @author 0m 0s The patch does not contain any @author tags.
          +1 tests included 0m 0s The patch appears to include 6 new or modified test files.
          +1 javac 7m 28s There were no new javac warning messages.
          +1 release audit 0m 20s The applied patch does not increase the total number of release audit warnings.
          +1 whitespace 0m 1s The patch has no lines that end in whitespace.
          +1 install 1m 32s mvn install still works.
          +1 eclipse:eclipse 0m 32s The patch built with eclipse:eclipse.
          +1 mapreduce tests 10m 28s Tests passed in hadoop-mapreduce-client-app.
          +1 mapreduce tests 0m 44s Tests passed in hadoop-mapreduce-client-common.
          +1 mapreduce tests 1m 55s Tests passed in hadoop-mapreduce-client-core.
          +1 mapreduce tests 6m 34s Tests passed in hadoop-mapreduce-client-hs.
          +1 mapreduce tests 108m 28s Tests passed in hadoop-mapreduce-client-jobclient.
          +1 mapreduce tests 0m 24s Tests passed in hadoop-mapreduce-client-shuffle.
              143m 44s  



          Subsystem Report/Notes
          Patch URL http://issues.apache.org/jira/secure/attachment/12730502/MAPREDUCE-6356.patch
          Optional Tests javac unit
          git revision trunk / 9356cf8
          hadoop-mapreduce-client-app test log https://builds.apache.org/job/PreCommit-MAPREDUCE-Build/5644/artifact/patchprocess/testrun_hadoop-mapreduce-client-app.txt
          hadoop-mapreduce-client-common test log https://builds.apache.org/job/PreCommit-MAPREDUCE-Build/5644/artifact/patchprocess/testrun_hadoop-mapreduce-client-common.txt
          hadoop-mapreduce-client-core test log https://builds.apache.org/job/PreCommit-MAPREDUCE-Build/5644/artifact/patchprocess/testrun_hadoop-mapreduce-client-core.txt
          hadoop-mapreduce-client-hs test log https://builds.apache.org/job/PreCommit-MAPREDUCE-Build/5644/artifact/patchprocess/testrun_hadoop-mapreduce-client-hs.txt
          hadoop-mapreduce-client-jobclient test log https://builds.apache.org/job/PreCommit-MAPREDUCE-Build/5644/artifact/patchprocess/testrun_hadoop-mapreduce-client-jobclient.txt
          hadoop-mapreduce-client-shuffle test log https://builds.apache.org/job/PreCommit-MAPREDUCE-Build/5644/artifact/patchprocess/testrun_hadoop-mapreduce-client-shuffle.txt
          Test Results https://builds.apache.org/job/PreCommit-MAPREDUCE-Build/5644/testReport/
          Java 1.7.0_55
          uname Linux asf902.gq1.ygridcore.net 3.13.0-36-lowlatency #63-Ubuntu SMP PREEMPT Wed Sep 3 21:56:12 UTC 2014 x86_64 x86_64 x86_64 GNU/Linux
          Console output https://builds.apache.org/job/PreCommit-MAPREDUCE-Build/5644/console

          This message was automatically generated.

          Show
          hadoopqa Hadoop QA added a comment - +1 overall Vote Subsystem Runtime Comment 0 pre-patch 5m 15s Pre-patch trunk compilation is healthy. +1 @author 0m 0s The patch does not contain any @author tags. +1 tests included 0m 0s The patch appears to include 6 new or modified test files. +1 javac 7m 28s There were no new javac warning messages. +1 release audit 0m 20s The applied patch does not increase the total number of release audit warnings. +1 whitespace 0m 1s The patch has no lines that end in whitespace. +1 install 1m 32s mvn install still works. +1 eclipse:eclipse 0m 32s The patch built with eclipse:eclipse. +1 mapreduce tests 10m 28s Tests passed in hadoop-mapreduce-client-app. +1 mapreduce tests 0m 44s Tests passed in hadoop-mapreduce-client-common. +1 mapreduce tests 1m 55s Tests passed in hadoop-mapreduce-client-core. +1 mapreduce tests 6m 34s Tests passed in hadoop-mapreduce-client-hs. +1 mapreduce tests 108m 28s Tests passed in hadoop-mapreduce-client-jobclient. +1 mapreduce tests 0m 24s Tests passed in hadoop-mapreduce-client-shuffle.     143m 44s   Subsystem Report/Notes Patch URL http://issues.apache.org/jira/secure/attachment/12730502/MAPREDUCE-6356.patch Optional Tests javac unit git revision trunk / 9356cf8 hadoop-mapreduce-client-app test log https://builds.apache.org/job/PreCommit-MAPREDUCE-Build/5644/artifact/patchprocess/testrun_hadoop-mapreduce-client-app.txt hadoop-mapreduce-client-common test log https://builds.apache.org/job/PreCommit-MAPREDUCE-Build/5644/artifact/patchprocess/testrun_hadoop-mapreduce-client-common.txt hadoop-mapreduce-client-core test log https://builds.apache.org/job/PreCommit-MAPREDUCE-Build/5644/artifact/patchprocess/testrun_hadoop-mapreduce-client-core.txt hadoop-mapreduce-client-hs test log https://builds.apache.org/job/PreCommit-MAPREDUCE-Build/5644/artifact/patchprocess/testrun_hadoop-mapreduce-client-hs.txt hadoop-mapreduce-client-jobclient test log https://builds.apache.org/job/PreCommit-MAPREDUCE-Build/5644/artifact/patchprocess/testrun_hadoop-mapreduce-client-jobclient.txt hadoop-mapreduce-client-shuffle test log https://builds.apache.org/job/PreCommit-MAPREDUCE-Build/5644/artifact/patchprocess/testrun_hadoop-mapreduce-client-shuffle.txt Test Results https://builds.apache.org/job/PreCommit-MAPREDUCE-Build/5644/testReport/ Java 1.7.0_55 uname Linux asf902.gq1.ygridcore.net 3.13.0-36-lowlatency #63-Ubuntu SMP PREEMPT Wed Sep 3 21:56:12 UTC 2014 x86_64 x86_64 x86_64 GNU/Linux Console output https://builds.apache.org/job/PreCommit-MAPREDUCE-Build/5644/console This message was automatically generated.
          Hide
          ajisakaa Akira Ajisaka added a comment -

          Hi Brahma Reddy Battula, thank you for splitting the patch. Would you fix the typo in hadoop-mapreduce-project/hadoop-mapreduce-client/hadoop-mapreduce-client-nativetask/src/test/resources/log4j.properties as well?

          Show
          ajisakaa Akira Ajisaka added a comment - Hi Brahma Reddy Battula , thank you for splitting the patch. Would you fix the typo in hadoop-mapreduce-project/hadoop-mapreduce-client/hadoop-mapreduce-client-nativetask/src/test/resources/log4j.properties as well?
          Hide
          brahmareddy Brahma Reddy Battula added a comment -

          Thanks Akira Ajisaka taking a lookinto this issue..Updated the patch..Kindly Review!!

          Show
          brahmareddy Brahma Reddy Battula added a comment - Thanks Akira Ajisaka taking a lookinto this issue..Updated the patch..Kindly Review!!
          Hide
          ajisakaa Akira Ajisaka added a comment -

          +1 pending Jenkins. Thanks Brahma Reddy Battula.

          Show
          ajisakaa Akira Ajisaka added a comment - +1 pending Jenkins. Thanks Brahma Reddy Battula .
          Hide
          hadoopqa Hadoop QA added a comment -



          -1 overall



          Vote Subsystem Runtime Comment
          0 pre-patch 5m 13s Pre-patch trunk compilation is healthy.
          +1 @author 0m 0s The patch does not contain any @author tags.
          +1 tests included 0m 0s The patch appears to include 7 new or modified test files.
          +1 javac 7m 38s There were no new javac warning messages.
          +1 release audit 0m 19s The applied patch does not increase the total number of release audit warnings.
          +1 whitespace 0m 0s The patch has no lines that end in whitespace.
          +1 install 1m 33s mvn install still works.
          +1 eclipse:eclipse 0m 33s The patch built with eclipse:eclipse.
          +1 mapreduce tests 9m 25s Tests passed in hadoop-mapreduce-client-app.
          +1 mapreduce tests 0m 46s Tests passed in hadoop-mapreduce-client-common.
          +1 mapreduce tests 1m 44s Tests passed in hadoop-mapreduce-client-core.
          +1 mapreduce tests 5m 36s Tests passed in hadoop-mapreduce-client-hs.
          -1 mapreduce tests 30m 28s Tests failed in hadoop-mapreduce-client-jobclient.
          +1 mapreduce tests 10m 10s Tests passed in hadoop-mapreduce-client-nativetask.
          +1 mapreduce tests 0m 20s Tests passed in hadoop-mapreduce-client-shuffle.
              73m 48s  



          Reason Tests
          Failed unit tests hadoop.mapreduce.v2.TestSpeculativeExecution
            hadoop.mapreduce.security.ssl.TestEncryptedShuffle
            hadoop.mapred.TestMiniMRChildTask
            hadoop.mapred.TestMiniMRBringup
            hadoop.mapred.TestMiniMRClientCluster
            hadoop.mapred.TestClusterMRNotification
            hadoop.mapred.TestMRTimelineEventHandling
            hadoop.mapreduce.v2.TestMRJobsWithHistoryService
            hadoop.mapreduce.security.TestBinaryTokenFile
            hadoop.mapred.TestReduceFetch
            hadoop.mapreduce.v2.TestNonExistentJob
            hadoop.mapreduce.v2.TestMiniMRProxyUser
            hadoop.mapred.TestNetworkedJob
            hadoop.mapreduce.v2.TestMROldApiJobs
            hadoop.mapred.TestClusterMapReduceTestCase
            hadoop.mapred.TestMRIntermediateDataEncryption
            hadoop.mapred.TestReduceFetchFromPartialMem
            hadoop.mapreduce.lib.output.TestJobOutputCommitter
            hadoop.mapreduce.TestLargeSort
            hadoop.mapreduce.v2.TestMRAppWithCombiner
            hadoop.mapred.TestJobName
            hadoop.mapreduce.v2.TestMRJobsWithProfiler
            hadoop.mapred.TestLocalJobSubmission
            hadoop.mapreduce.TestMapReduceLazyOutput
            hadoop.mapred.TestSpecialCharactersInOutputPath
            hadoop.mapreduce.v2.TestUberAM
            hadoop.mapreduce.security.TestMRCredentials
            hadoop.mapred.TestLazyOutput
            hadoop.mapred.TestMerge
            hadoop.mapreduce.v2.TestMRAMWithNonNormalizedCapabilities
            hadoop.mapreduce.v2.TestRMNMInfo
            hadoop.mapred.TestJobCleanup
            hadoop.mapreduce.TestChild
            hadoop.mapreduce.TestMRJobClient
            hadoop.mapreduce.v2.TestMRJobs



          Subsystem Report/Notes
          Patch URL http://issues.apache.org/jira/secure/attachment/12731078/MAPREDUCE-6356-002.patch
          Optional Tests javac unit
          git revision trunk / 918af8e
          hadoop-mapreduce-client-app test log https://builds.apache.org/job/PreCommit-MAPREDUCE-Build/5656/artifact/patchprocess/testrun_hadoop-mapreduce-client-app.txt
          hadoop-mapreduce-client-common test log https://builds.apache.org/job/PreCommit-MAPREDUCE-Build/5656/artifact/patchprocess/testrun_hadoop-mapreduce-client-common.txt
          hadoop-mapreduce-client-core test log https://builds.apache.org/job/PreCommit-MAPREDUCE-Build/5656/artifact/patchprocess/testrun_hadoop-mapreduce-client-core.txt
          hadoop-mapreduce-client-hs test log https://builds.apache.org/job/PreCommit-MAPREDUCE-Build/5656/artifact/patchprocess/testrun_hadoop-mapreduce-client-hs.txt
          hadoop-mapreduce-client-jobclient test log https://builds.apache.org/job/PreCommit-MAPREDUCE-Build/5656/artifact/patchprocess/testrun_hadoop-mapreduce-client-jobclient.txt
          hadoop-mapreduce-client-nativetask test log https://builds.apache.org/job/PreCommit-MAPREDUCE-Build/5656/artifact/patchprocess/testrun_hadoop-mapreduce-client-nativetask.txt
          hadoop-mapreduce-client-shuffle test log https://builds.apache.org/job/PreCommit-MAPREDUCE-Build/5656/artifact/patchprocess/testrun_hadoop-mapreduce-client-shuffle.txt
          Test Results https://builds.apache.org/job/PreCommit-MAPREDUCE-Build/5656/testReport/
          Java 1.7.0_55
          uname Linux asf903.gq1.ygridcore.net 3.13.0-36-lowlatency #63-Ubuntu SMP PREEMPT Wed Sep 3 21:56:12 UTC 2014 x86_64 x86_64 x86_64 GNU/Linux
          Console output https://builds.apache.org/job/PreCommit-MAPREDUCE-Build/5656/console

          This message was automatically generated.

          Show
          hadoopqa Hadoop QA added a comment - -1 overall Vote Subsystem Runtime Comment 0 pre-patch 5m 13s Pre-patch trunk compilation is healthy. +1 @author 0m 0s The patch does not contain any @author tags. +1 tests included 0m 0s The patch appears to include 7 new or modified test files. +1 javac 7m 38s There were no new javac warning messages. +1 release audit 0m 19s The applied patch does not increase the total number of release audit warnings. +1 whitespace 0m 0s The patch has no lines that end in whitespace. +1 install 1m 33s mvn install still works. +1 eclipse:eclipse 0m 33s The patch built with eclipse:eclipse. +1 mapreduce tests 9m 25s Tests passed in hadoop-mapreduce-client-app. +1 mapreduce tests 0m 46s Tests passed in hadoop-mapreduce-client-common. +1 mapreduce tests 1m 44s Tests passed in hadoop-mapreduce-client-core. +1 mapreduce tests 5m 36s Tests passed in hadoop-mapreduce-client-hs. -1 mapreduce tests 30m 28s Tests failed in hadoop-mapreduce-client-jobclient. +1 mapreduce tests 10m 10s Tests passed in hadoop-mapreduce-client-nativetask. +1 mapreduce tests 0m 20s Tests passed in hadoop-mapreduce-client-shuffle.     73m 48s   Reason Tests Failed unit tests hadoop.mapreduce.v2.TestSpeculativeExecution   hadoop.mapreduce.security.ssl.TestEncryptedShuffle   hadoop.mapred.TestMiniMRChildTask   hadoop.mapred.TestMiniMRBringup   hadoop.mapred.TestMiniMRClientCluster   hadoop.mapred.TestClusterMRNotification   hadoop.mapred.TestMRTimelineEventHandling   hadoop.mapreduce.v2.TestMRJobsWithHistoryService   hadoop.mapreduce.security.TestBinaryTokenFile   hadoop.mapred.TestReduceFetch   hadoop.mapreduce.v2.TestNonExistentJob   hadoop.mapreduce.v2.TestMiniMRProxyUser   hadoop.mapred.TestNetworkedJob   hadoop.mapreduce.v2.TestMROldApiJobs   hadoop.mapred.TestClusterMapReduceTestCase   hadoop.mapred.TestMRIntermediateDataEncryption   hadoop.mapred.TestReduceFetchFromPartialMem   hadoop.mapreduce.lib.output.TestJobOutputCommitter   hadoop.mapreduce.TestLargeSort   hadoop.mapreduce.v2.TestMRAppWithCombiner   hadoop.mapred.TestJobName   hadoop.mapreduce.v2.TestMRJobsWithProfiler   hadoop.mapred.TestLocalJobSubmission   hadoop.mapreduce.TestMapReduceLazyOutput   hadoop.mapred.TestSpecialCharactersInOutputPath   hadoop.mapreduce.v2.TestUberAM   hadoop.mapreduce.security.TestMRCredentials   hadoop.mapred.TestLazyOutput   hadoop.mapred.TestMerge   hadoop.mapreduce.v2.TestMRAMWithNonNormalizedCapabilities   hadoop.mapreduce.v2.TestRMNMInfo   hadoop.mapred.TestJobCleanup   hadoop.mapreduce.TestChild   hadoop.mapreduce.TestMRJobClient   hadoop.mapreduce.v2.TestMRJobs Subsystem Report/Notes Patch URL http://issues.apache.org/jira/secure/attachment/12731078/MAPREDUCE-6356-002.patch Optional Tests javac unit git revision trunk / 918af8e hadoop-mapreduce-client-app test log https://builds.apache.org/job/PreCommit-MAPREDUCE-Build/5656/artifact/patchprocess/testrun_hadoop-mapreduce-client-app.txt hadoop-mapreduce-client-common test log https://builds.apache.org/job/PreCommit-MAPREDUCE-Build/5656/artifact/patchprocess/testrun_hadoop-mapreduce-client-common.txt hadoop-mapreduce-client-core test log https://builds.apache.org/job/PreCommit-MAPREDUCE-Build/5656/artifact/patchprocess/testrun_hadoop-mapreduce-client-core.txt hadoop-mapreduce-client-hs test log https://builds.apache.org/job/PreCommit-MAPREDUCE-Build/5656/artifact/patchprocess/testrun_hadoop-mapreduce-client-hs.txt hadoop-mapreduce-client-jobclient test log https://builds.apache.org/job/PreCommit-MAPREDUCE-Build/5656/artifact/patchprocess/testrun_hadoop-mapreduce-client-jobclient.txt hadoop-mapreduce-client-nativetask test log https://builds.apache.org/job/PreCommit-MAPREDUCE-Build/5656/artifact/patchprocess/testrun_hadoop-mapreduce-client-nativetask.txt hadoop-mapreduce-client-shuffle test log https://builds.apache.org/job/PreCommit-MAPREDUCE-Build/5656/artifact/patchprocess/testrun_hadoop-mapreduce-client-shuffle.txt Test Results https://builds.apache.org/job/PreCommit-MAPREDUCE-Build/5656/testReport/ Java 1.7.0_55 uname Linux asf903.gq1.ygridcore.net 3.13.0-36-lowlatency #63-Ubuntu SMP PREEMPT Wed Sep 3 21:56:12 UTC 2014 x86_64 x86_64 x86_64 GNU/Linux Console output https://builds.apache.org/job/PreCommit-MAPREDUCE-Build/5656/console This message was automatically generated.
          Hide
          ajisakaa Akira Ajisaka added a comment -

          Many tests are failing with java.lang.NoClassDefFoundError. Looks like the jars in the repository used by the tests are stale.

          Show
          ajisakaa Akira Ajisaka added a comment - Many tests are failing with java.lang.NoClassDefFoundError. Looks like the jars in the repository used by the tests are stale.
          Hide
          ajisakaa Akira Ajisaka added a comment -
          Show
          ajisakaa Akira Ajisaka added a comment - Submitted jenkins job: https://builds.apache.org/job/PreCommit-MAPREDUCE-Build/5659/
          Hide
          hadoopqa Hadoop QA added a comment -



          +1 overall



          Vote Subsystem Runtime Comment
          0 pre-patch 5m 9s Pre-patch trunk compilation is healthy.
          +1 @author 0m 0s The patch does not contain any @author tags.
          +1 tests included 0m 0s The patch appears to include 7 new or modified test files.
          +1 javac 7m 28s There were no new javac warning messages.
          +1 release audit 0m 19s The applied patch does not increase the total number of release audit warnings.
          +1 whitespace 0m 0s The patch has no lines that end in whitespace.
          +1 install 1m 32s mvn install still works.
          +1 eclipse:eclipse 0m 32s The patch built with eclipse:eclipse.
          +1 mapreduce tests 9m 7s Tests passed in hadoop-mapreduce-client-app.
          +1 mapreduce tests 0m 44s Tests passed in hadoop-mapreduce-client-common.
          +1 mapreduce tests 1m 35s Tests passed in hadoop-mapreduce-client-core.
          +1 mapreduce tests 5m 39s Tests passed in hadoop-mapreduce-client-hs.
          +1 mapreduce tests 105m 41s Tests passed in hadoop-mapreduce-client-jobclient.
          +1 mapreduce tests 10m 17s Tests passed in hadoop-mapreduce-client-nativetask.
          +1 mapreduce tests 0m 24s Tests passed in hadoop-mapreduce-client-shuffle.
              148m 32s  



          Subsystem Report/Notes
          Patch URL http://issues.apache.org/jira/secure/attachment/12731078/MAPREDUCE-6356-002.patch
          Optional Tests javac unit
          git revision trunk / 449e442
          hadoop-mapreduce-client-app test log https://builds.apache.org/job/PreCommit-MAPREDUCE-Build/5659/artifact/patchprocess/testrun_hadoop-mapreduce-client-app.txt
          hadoop-mapreduce-client-common test log https://builds.apache.org/job/PreCommit-MAPREDUCE-Build/5659/artifact/patchprocess/testrun_hadoop-mapreduce-client-common.txt
          hadoop-mapreduce-client-core test log https://builds.apache.org/job/PreCommit-MAPREDUCE-Build/5659/artifact/patchprocess/testrun_hadoop-mapreduce-client-core.txt
          hadoop-mapreduce-client-hs test log https://builds.apache.org/job/PreCommit-MAPREDUCE-Build/5659/artifact/patchprocess/testrun_hadoop-mapreduce-client-hs.txt
          hadoop-mapreduce-client-jobclient test log https://builds.apache.org/job/PreCommit-MAPREDUCE-Build/5659/artifact/patchprocess/testrun_hadoop-mapreduce-client-jobclient.txt
          hadoop-mapreduce-client-nativetask test log https://builds.apache.org/job/PreCommit-MAPREDUCE-Build/5659/artifact/patchprocess/testrun_hadoop-mapreduce-client-nativetask.txt
          hadoop-mapreduce-client-shuffle test log https://builds.apache.org/job/PreCommit-MAPREDUCE-Build/5659/artifact/patchprocess/testrun_hadoop-mapreduce-client-shuffle.txt
          Test Results https://builds.apache.org/job/PreCommit-MAPREDUCE-Build/5659/testReport/
          Java 1.7.0_55
          uname Linux asf905.gq1.ygridcore.net 3.13.0-36-lowlatency #63-Ubuntu SMP PREEMPT Wed Sep 3 21:56:12 UTC 2014 x86_64 x86_64 x86_64 GNU/Linux
          Console output https://builds.apache.org/job/PreCommit-MAPREDUCE-Build/5659/console

          This message was automatically generated.

          Show
          hadoopqa Hadoop QA added a comment - +1 overall Vote Subsystem Runtime Comment 0 pre-patch 5m 9s Pre-patch trunk compilation is healthy. +1 @author 0m 0s The patch does not contain any @author tags. +1 tests included 0m 0s The patch appears to include 7 new or modified test files. +1 javac 7m 28s There were no new javac warning messages. +1 release audit 0m 19s The applied patch does not increase the total number of release audit warnings. +1 whitespace 0m 0s The patch has no lines that end in whitespace. +1 install 1m 32s mvn install still works. +1 eclipse:eclipse 0m 32s The patch built with eclipse:eclipse. +1 mapreduce tests 9m 7s Tests passed in hadoop-mapreduce-client-app. +1 mapreduce tests 0m 44s Tests passed in hadoop-mapreduce-client-common. +1 mapreduce tests 1m 35s Tests passed in hadoop-mapreduce-client-core. +1 mapreduce tests 5m 39s Tests passed in hadoop-mapreduce-client-hs. +1 mapreduce tests 105m 41s Tests passed in hadoop-mapreduce-client-jobclient. +1 mapreduce tests 10m 17s Tests passed in hadoop-mapreduce-client-nativetask. +1 mapreduce tests 0m 24s Tests passed in hadoop-mapreduce-client-shuffle.     148m 32s   Subsystem Report/Notes Patch URL http://issues.apache.org/jira/secure/attachment/12731078/MAPREDUCE-6356-002.patch Optional Tests javac unit git revision trunk / 449e442 hadoop-mapreduce-client-app test log https://builds.apache.org/job/PreCommit-MAPREDUCE-Build/5659/artifact/patchprocess/testrun_hadoop-mapreduce-client-app.txt hadoop-mapreduce-client-common test log https://builds.apache.org/job/PreCommit-MAPREDUCE-Build/5659/artifact/patchprocess/testrun_hadoop-mapreduce-client-common.txt hadoop-mapreduce-client-core test log https://builds.apache.org/job/PreCommit-MAPREDUCE-Build/5659/artifact/patchprocess/testrun_hadoop-mapreduce-client-core.txt hadoop-mapreduce-client-hs test log https://builds.apache.org/job/PreCommit-MAPREDUCE-Build/5659/artifact/patchprocess/testrun_hadoop-mapreduce-client-hs.txt hadoop-mapreduce-client-jobclient test log https://builds.apache.org/job/PreCommit-MAPREDUCE-Build/5659/artifact/patchprocess/testrun_hadoop-mapreduce-client-jobclient.txt hadoop-mapreduce-client-nativetask test log https://builds.apache.org/job/PreCommit-MAPREDUCE-Build/5659/artifact/patchprocess/testrun_hadoop-mapreduce-client-nativetask.txt hadoop-mapreduce-client-shuffle test log https://builds.apache.org/job/PreCommit-MAPREDUCE-Build/5659/artifact/patchprocess/testrun_hadoop-mapreduce-client-shuffle.txt Test Results https://builds.apache.org/job/PreCommit-MAPREDUCE-Build/5659/testReport/ Java 1.7.0_55 uname Linux asf905.gq1.ygridcore.net 3.13.0-36-lowlatency #63-Ubuntu SMP PREEMPT Wed Sep 3 21:56:12 UTC 2014 x86_64 x86_64 x86_64 GNU/Linux Console output https://builds.apache.org/job/PreCommit-MAPREDUCE-Build/5659/console This message was automatically generated.
          Hide
          ajisakaa Akira Ajisaka added a comment -

          +1, committed this to trunk and branch-2. Thanks Brahma Reddy Battula for the contribution.

          Show
          ajisakaa Akira Ajisaka added a comment - +1, committed this to trunk and branch-2. Thanks Brahma Reddy Battula for the contribution.
          Hide
          hudson Hudson added a comment -

          FAILURE: Integrated in Hadoop-trunk-Commit #7757 (See https://builds.apache.org/job/Hadoop-trunk-Commit/7757/)
          MAPREDUCE-6356. Misspelling of threshold in log4j.properties for tests. Contributed by Brahma Reddy Battula. (aajisaka: rev d335071398fdb14153c854b740814b4fd385b658)

          • hadoop-mapreduce-project/hadoop-mapreduce-client/hadoop-mapreduce-client-shuffle/src/test/resources/log4j.properties
          • hadoop-mapreduce-project/hadoop-mapreduce-client/hadoop-mapreduce-client-app/src/test/resources/log4j.properties
          • hadoop-mapreduce-project/CHANGES.txt
          • hadoop-mapreduce-project/hadoop-mapreduce-client/hadoop-mapreduce-client-hs/src/test/resources/log4j.properties
          • hadoop-mapreduce-project/hadoop-mapreduce-client/hadoop-mapreduce-client-core/src/test/resources/log4j.properties
          • hadoop-mapreduce-project/hadoop-mapreduce-client/hadoop-mapreduce-client-common/src/test/resources/log4j.properties
          • hadoop-mapreduce-project/hadoop-mapreduce-client/hadoop-mapreduce-client-jobclient/src/test/resources/log4j.properties
          • hadoop-mapreduce-project/hadoop-mapreduce-client/hadoop-mapreduce-client-nativetask/src/test/resources/log4j.properties
          Show
          hudson Hudson added a comment - FAILURE: Integrated in Hadoop-trunk-Commit #7757 (See https://builds.apache.org/job/Hadoop-trunk-Commit/7757/ ) MAPREDUCE-6356 . Misspelling of threshold in log4j.properties for tests. Contributed by Brahma Reddy Battula. (aajisaka: rev d335071398fdb14153c854b740814b4fd385b658) hadoop-mapreduce-project/hadoop-mapreduce-client/hadoop-mapreduce-client-shuffle/src/test/resources/log4j.properties hadoop-mapreduce-project/hadoop-mapreduce-client/hadoop-mapreduce-client-app/src/test/resources/log4j.properties hadoop-mapreduce-project/CHANGES.txt hadoop-mapreduce-project/hadoop-mapreduce-client/hadoop-mapreduce-client-hs/src/test/resources/log4j.properties hadoop-mapreduce-project/hadoop-mapreduce-client/hadoop-mapreduce-client-core/src/test/resources/log4j.properties hadoop-mapreduce-project/hadoop-mapreduce-client/hadoop-mapreduce-client-common/src/test/resources/log4j.properties hadoop-mapreduce-project/hadoop-mapreduce-client/hadoop-mapreduce-client-jobclient/src/test/resources/log4j.properties hadoop-mapreduce-project/hadoop-mapreduce-client/hadoop-mapreduce-client-nativetask/src/test/resources/log4j.properties
          Hide
          hudson Hudson added a comment -

          FAILURE: Integrated in Hadoop-Hdfs-trunk #2118 (See https://builds.apache.org/job/Hadoop-Hdfs-trunk/2118/)
          MAPREDUCE-6356. Misspelling of threshold in log4j.properties for tests. Contributed by Brahma Reddy Battula. (aajisaka: rev d335071398fdb14153c854b740814b4fd385b658)

          • hadoop-mapreduce-project/hadoop-mapreduce-client/hadoop-mapreduce-client-app/src/test/resources/log4j.properties
          • hadoop-mapreduce-project/hadoop-mapreduce-client/hadoop-mapreduce-client-shuffle/src/test/resources/log4j.properties
          • hadoop-mapreduce-project/hadoop-mapreduce-client/hadoop-mapreduce-client-hs/src/test/resources/log4j.properties
          • hadoop-mapreduce-project/hadoop-mapreduce-client/hadoop-mapreduce-client-jobclient/src/test/resources/log4j.properties
          • hadoop-mapreduce-project/hadoop-mapreduce-client/hadoop-mapreduce-client-common/src/test/resources/log4j.properties
          • hadoop-mapreduce-project/CHANGES.txt
          • hadoop-mapreduce-project/hadoop-mapreduce-client/hadoop-mapreduce-client-core/src/test/resources/log4j.properties
          • hadoop-mapreduce-project/hadoop-mapreduce-client/hadoop-mapreduce-client-nativetask/src/test/resources/log4j.properties
          Show
          hudson Hudson added a comment - FAILURE: Integrated in Hadoop-Hdfs-trunk #2118 (See https://builds.apache.org/job/Hadoop-Hdfs-trunk/2118/ ) MAPREDUCE-6356 . Misspelling of threshold in log4j.properties for tests. Contributed by Brahma Reddy Battula. (aajisaka: rev d335071398fdb14153c854b740814b4fd385b658) hadoop-mapreduce-project/hadoop-mapreduce-client/hadoop-mapreduce-client-app/src/test/resources/log4j.properties hadoop-mapreduce-project/hadoop-mapreduce-client/hadoop-mapreduce-client-shuffle/src/test/resources/log4j.properties hadoop-mapreduce-project/hadoop-mapreduce-client/hadoop-mapreduce-client-hs/src/test/resources/log4j.properties hadoop-mapreduce-project/hadoop-mapreduce-client/hadoop-mapreduce-client-jobclient/src/test/resources/log4j.properties hadoop-mapreduce-project/hadoop-mapreduce-client/hadoop-mapreduce-client-common/src/test/resources/log4j.properties hadoop-mapreduce-project/CHANGES.txt hadoop-mapreduce-project/hadoop-mapreduce-client/hadoop-mapreduce-client-core/src/test/resources/log4j.properties hadoop-mapreduce-project/hadoop-mapreduce-client/hadoop-mapreduce-client-nativetask/src/test/resources/log4j.properties
          Hide
          hudson Hudson added a comment -

          FAILURE: Integrated in Hadoop-Hdfs-trunk-Java8 #177 (See https://builds.apache.org/job/Hadoop-Hdfs-trunk-Java8/177/)
          MAPREDUCE-6356. Misspelling of threshold in log4j.properties for tests. Contributed by Brahma Reddy Battula. (aajisaka: rev d335071398fdb14153c854b740814b4fd385b658)

          • hadoop-mapreduce-project/hadoop-mapreduce-client/hadoop-mapreduce-client-shuffle/src/test/resources/log4j.properties
          • hadoop-mapreduce-project/hadoop-mapreduce-client/hadoop-mapreduce-client-common/src/test/resources/log4j.properties
          • hadoop-mapreduce-project/hadoop-mapreduce-client/hadoop-mapreduce-client-app/src/test/resources/log4j.properties
          • hadoop-mapreduce-project/hadoop-mapreduce-client/hadoop-mapreduce-client-jobclient/src/test/resources/log4j.properties
          • hadoop-mapreduce-project/hadoop-mapreduce-client/hadoop-mapreduce-client-hs/src/test/resources/log4j.properties
          • hadoop-mapreduce-project/CHANGES.txt
          • hadoop-mapreduce-project/hadoop-mapreduce-client/hadoop-mapreduce-client-core/src/test/resources/log4j.properties
          • hadoop-mapreduce-project/hadoop-mapreduce-client/hadoop-mapreduce-client-nativetask/src/test/resources/log4j.properties
          Show
          hudson Hudson added a comment - FAILURE: Integrated in Hadoop-Hdfs-trunk-Java8 #177 (See https://builds.apache.org/job/Hadoop-Hdfs-trunk-Java8/177/ ) MAPREDUCE-6356 . Misspelling of threshold in log4j.properties for tests. Contributed by Brahma Reddy Battula. (aajisaka: rev d335071398fdb14153c854b740814b4fd385b658) hadoop-mapreduce-project/hadoop-mapreduce-client/hadoop-mapreduce-client-shuffle/src/test/resources/log4j.properties hadoop-mapreduce-project/hadoop-mapreduce-client/hadoop-mapreduce-client-common/src/test/resources/log4j.properties hadoop-mapreduce-project/hadoop-mapreduce-client/hadoop-mapreduce-client-app/src/test/resources/log4j.properties hadoop-mapreduce-project/hadoop-mapreduce-client/hadoop-mapreduce-client-jobclient/src/test/resources/log4j.properties hadoop-mapreduce-project/hadoop-mapreduce-client/hadoop-mapreduce-client-hs/src/test/resources/log4j.properties hadoop-mapreduce-project/CHANGES.txt hadoop-mapreduce-project/hadoop-mapreduce-client/hadoop-mapreduce-client-core/src/test/resources/log4j.properties hadoop-mapreduce-project/hadoop-mapreduce-client/hadoop-mapreduce-client-nativetask/src/test/resources/log4j.properties
          Hide
          hudson Hudson added a comment -

          FAILURE: Integrated in Hadoop-Mapreduce-trunk-Java8 #187 (See https://builds.apache.org/job/Hadoop-Mapreduce-trunk-Java8/187/)
          MAPREDUCE-6356. Misspelling of threshold in log4j.properties for tests. Contributed by Brahma Reddy Battula. (aajisaka: rev d335071398fdb14153c854b740814b4fd385b658)

          • hadoop-mapreduce-project/hadoop-mapreduce-client/hadoop-mapreduce-client-jobclient/src/test/resources/log4j.properties
          • hadoop-mapreduce-project/hadoop-mapreduce-client/hadoop-mapreduce-client-app/src/test/resources/log4j.properties
          • hadoop-mapreduce-project/hadoop-mapreduce-client/hadoop-mapreduce-client-nativetask/src/test/resources/log4j.properties
          • hadoop-mapreduce-project/hadoop-mapreduce-client/hadoop-mapreduce-client-hs/src/test/resources/log4j.properties
          • hadoop-mapreduce-project/hadoop-mapreduce-client/hadoop-mapreduce-client-shuffle/src/test/resources/log4j.properties
          • hadoop-mapreduce-project/hadoop-mapreduce-client/hadoop-mapreduce-client-core/src/test/resources/log4j.properties
          • hadoop-mapreduce-project/hadoop-mapreduce-client/hadoop-mapreduce-client-common/src/test/resources/log4j.properties
          • hadoop-mapreduce-project/CHANGES.txt
          Show
          hudson Hudson added a comment - FAILURE: Integrated in Hadoop-Mapreduce-trunk-Java8 #187 (See https://builds.apache.org/job/Hadoop-Mapreduce-trunk-Java8/187/ ) MAPREDUCE-6356 . Misspelling of threshold in log4j.properties for tests. Contributed by Brahma Reddy Battula. (aajisaka: rev d335071398fdb14153c854b740814b4fd385b658) hadoop-mapreduce-project/hadoop-mapreduce-client/hadoop-mapreduce-client-jobclient/src/test/resources/log4j.properties hadoop-mapreduce-project/hadoop-mapreduce-client/hadoop-mapreduce-client-app/src/test/resources/log4j.properties hadoop-mapreduce-project/hadoop-mapreduce-client/hadoop-mapreduce-client-nativetask/src/test/resources/log4j.properties hadoop-mapreduce-project/hadoop-mapreduce-client/hadoop-mapreduce-client-hs/src/test/resources/log4j.properties hadoop-mapreduce-project/hadoop-mapreduce-client/hadoop-mapreduce-client-shuffle/src/test/resources/log4j.properties hadoop-mapreduce-project/hadoop-mapreduce-client/hadoop-mapreduce-client-core/src/test/resources/log4j.properties hadoop-mapreduce-project/hadoop-mapreduce-client/hadoop-mapreduce-client-common/src/test/resources/log4j.properties hadoop-mapreduce-project/CHANGES.txt
          Hide
          hudson Hudson added a comment -

          SUCCESS: Integrated in Hadoop-Mapreduce-trunk #2136 (See https://builds.apache.org/job/Hadoop-Mapreduce-trunk/2136/)
          MAPREDUCE-6356. Misspelling of threshold in log4j.properties for tests. Contributed by Brahma Reddy Battula. (aajisaka: rev d335071398fdb14153c854b740814b4fd385b658)

          • hadoop-mapreduce-project/CHANGES.txt
          • hadoop-mapreduce-project/hadoop-mapreduce-client/hadoop-mapreduce-client-nativetask/src/test/resources/log4j.properties
          • hadoop-mapreduce-project/hadoop-mapreduce-client/hadoop-mapreduce-client-app/src/test/resources/log4j.properties
          • hadoop-mapreduce-project/hadoop-mapreduce-client/hadoop-mapreduce-client-jobclient/src/test/resources/log4j.properties
          • hadoop-mapreduce-project/hadoop-mapreduce-client/hadoop-mapreduce-client-common/src/test/resources/log4j.properties
          • hadoop-mapreduce-project/hadoop-mapreduce-client/hadoop-mapreduce-client-hs/src/test/resources/log4j.properties
          • hadoop-mapreduce-project/hadoop-mapreduce-client/hadoop-mapreduce-client-shuffle/src/test/resources/log4j.properties
          • hadoop-mapreduce-project/hadoop-mapreduce-client/hadoop-mapreduce-client-core/src/test/resources/log4j.properties
          Show
          hudson Hudson added a comment - SUCCESS: Integrated in Hadoop-Mapreduce-trunk #2136 (See https://builds.apache.org/job/Hadoop-Mapreduce-trunk/2136/ ) MAPREDUCE-6356 . Misspelling of threshold in log4j.properties for tests. Contributed by Brahma Reddy Battula. (aajisaka: rev d335071398fdb14153c854b740814b4fd385b658) hadoop-mapreduce-project/CHANGES.txt hadoop-mapreduce-project/hadoop-mapreduce-client/hadoop-mapreduce-client-nativetask/src/test/resources/log4j.properties hadoop-mapreduce-project/hadoop-mapreduce-client/hadoop-mapreduce-client-app/src/test/resources/log4j.properties hadoop-mapreduce-project/hadoop-mapreduce-client/hadoop-mapreduce-client-jobclient/src/test/resources/log4j.properties hadoop-mapreduce-project/hadoop-mapreduce-client/hadoop-mapreduce-client-common/src/test/resources/log4j.properties hadoop-mapreduce-project/hadoop-mapreduce-client/hadoop-mapreduce-client-hs/src/test/resources/log4j.properties hadoop-mapreduce-project/hadoop-mapreduce-client/hadoop-mapreduce-client-shuffle/src/test/resources/log4j.properties hadoop-mapreduce-project/hadoop-mapreduce-client/hadoop-mapreduce-client-core/src/test/resources/log4j.properties
          Hide
          hudson Hudson added a comment -

          FAILURE: Integrated in Hadoop-Yarn-trunk-Java8 #188 (See https://builds.apache.org/job/Hadoop-Yarn-trunk-Java8/188/)
          MAPREDUCE-6356. Misspelling of threshold in log4j.properties for tests. Contributed by Brahma Reddy Battula. (aajisaka: rev d335071398fdb14153c854b740814b4fd385b658)

          • hadoop-mapreduce-project/hadoop-mapreduce-client/hadoop-mapreduce-client-nativetask/src/test/resources/log4j.properties
          • hadoop-mapreduce-project/hadoop-mapreduce-client/hadoop-mapreduce-client-core/src/test/resources/log4j.properties
          • hadoop-mapreduce-project/hadoop-mapreduce-client/hadoop-mapreduce-client-jobclient/src/test/resources/log4j.properties
          • hadoop-mapreduce-project/hadoop-mapreduce-client/hadoop-mapreduce-client-app/src/test/resources/log4j.properties
          • hadoop-mapreduce-project/CHANGES.txt
          • hadoop-mapreduce-project/hadoop-mapreduce-client/hadoop-mapreduce-client-hs/src/test/resources/log4j.properties
          • hadoop-mapreduce-project/hadoop-mapreduce-client/hadoop-mapreduce-client-shuffle/src/test/resources/log4j.properties
          • hadoop-mapreduce-project/hadoop-mapreduce-client/hadoop-mapreduce-client-common/src/test/resources/log4j.properties
          Show
          hudson Hudson added a comment - FAILURE: Integrated in Hadoop-Yarn-trunk-Java8 #188 (See https://builds.apache.org/job/Hadoop-Yarn-trunk-Java8/188/ ) MAPREDUCE-6356 . Misspelling of threshold in log4j.properties for tests. Contributed by Brahma Reddy Battula. (aajisaka: rev d335071398fdb14153c854b740814b4fd385b658) hadoop-mapreduce-project/hadoop-mapreduce-client/hadoop-mapreduce-client-nativetask/src/test/resources/log4j.properties hadoop-mapreduce-project/hadoop-mapreduce-client/hadoop-mapreduce-client-core/src/test/resources/log4j.properties hadoop-mapreduce-project/hadoop-mapreduce-client/hadoop-mapreduce-client-jobclient/src/test/resources/log4j.properties hadoop-mapreduce-project/hadoop-mapreduce-client/hadoop-mapreduce-client-app/src/test/resources/log4j.properties hadoop-mapreduce-project/CHANGES.txt hadoop-mapreduce-project/hadoop-mapreduce-client/hadoop-mapreduce-client-hs/src/test/resources/log4j.properties hadoop-mapreduce-project/hadoop-mapreduce-client/hadoop-mapreduce-client-shuffle/src/test/resources/log4j.properties hadoop-mapreduce-project/hadoop-mapreduce-client/hadoop-mapreduce-client-common/src/test/resources/log4j.properties
          Hide
          hudson Hudson added a comment -

          SUCCESS: Integrated in Hadoop-Yarn-trunk #921 (See https://builds.apache.org/job/Hadoop-Yarn-trunk/921/)
          MAPREDUCE-6356. Misspelling of threshold in log4j.properties for tests. Contributed by Brahma Reddy Battula. (aajisaka: rev d335071398fdb14153c854b740814b4fd385b658)

          • hadoop-mapreduce-project/hadoop-mapreduce-client/hadoop-mapreduce-client-common/src/test/resources/log4j.properties
          • hadoop-mapreduce-project/hadoop-mapreduce-client/hadoop-mapreduce-client-hs/src/test/resources/log4j.properties
          • hadoop-mapreduce-project/hadoop-mapreduce-client/hadoop-mapreduce-client-app/src/test/resources/log4j.properties
          • hadoop-mapreduce-project/hadoop-mapreduce-client/hadoop-mapreduce-client-shuffle/src/test/resources/log4j.properties
          • hadoop-mapreduce-project/hadoop-mapreduce-client/hadoop-mapreduce-client-jobclient/src/test/resources/log4j.properties
          • hadoop-mapreduce-project/CHANGES.txt
          • hadoop-mapreduce-project/hadoop-mapreduce-client/hadoop-mapreduce-client-nativetask/src/test/resources/log4j.properties
          • hadoop-mapreduce-project/hadoop-mapreduce-client/hadoop-mapreduce-client-core/src/test/resources/log4j.properties
          Show
          hudson Hudson added a comment - SUCCESS: Integrated in Hadoop-Yarn-trunk #921 (See https://builds.apache.org/job/Hadoop-Yarn-trunk/921/ ) MAPREDUCE-6356 . Misspelling of threshold in log4j.properties for tests. Contributed by Brahma Reddy Battula. (aajisaka: rev d335071398fdb14153c854b740814b4fd385b658) hadoop-mapreduce-project/hadoop-mapreduce-client/hadoop-mapreduce-client-common/src/test/resources/log4j.properties hadoop-mapreduce-project/hadoop-mapreduce-client/hadoop-mapreduce-client-hs/src/test/resources/log4j.properties hadoop-mapreduce-project/hadoop-mapreduce-client/hadoop-mapreduce-client-app/src/test/resources/log4j.properties hadoop-mapreduce-project/hadoop-mapreduce-client/hadoop-mapreduce-client-shuffle/src/test/resources/log4j.properties hadoop-mapreduce-project/hadoop-mapreduce-client/hadoop-mapreduce-client-jobclient/src/test/resources/log4j.properties hadoop-mapreduce-project/CHANGES.txt hadoop-mapreduce-project/hadoop-mapreduce-client/hadoop-mapreduce-client-nativetask/src/test/resources/log4j.properties hadoop-mapreduce-project/hadoop-mapreduce-client/hadoop-mapreduce-client-core/src/test/resources/log4j.properties

            People

            • Assignee:
              brahmareddy Brahma Reddy Battula
              Reporter:
              brahmareddy Brahma Reddy Battula
            • Votes:
              0 Vote for this issue
              Watchers:
              4 Start watching this issue

              Dates

              • Created:
                Updated:
                Resolved:

                Development