Uploaded image for project: 'Hadoop Map/Reduce'
  1. Hadoop Map/Reduce
  2. MAPREDUCE-5561

org.apache.hadoop.mapreduce.v2.app.job.impl.TestJobImpl testcase failing on trunk

VotersWatch issueWatchersCreate sub-taskLinkCloneUpdate Comment AuthorReplace String in CommentUpdate Comment VisibilityDelete Comments
    XMLWordPrintableJSON

Details

    • Bug
    • Status: Closed
    • Critical
    • Resolution: Fixed
    • 2.2.0
    • 0.23.10, 2.3.0
    • None
    • None
    • Reviewed

    Description

      Running org.apache.hadoop.mapreduce.v2.app.job.impl.TestJobImpl
      Tests run: 15, Failures: 1, Errors: 0, Skipped: 0, Time elapsed: 9.029 sec <<< FAILURE! - in org.apache.hadoop.mapreduce.v2.app.job.impl.TestJobImpl
      testFailAbortDoesntHang(org.apache.hadoop.mapreduce.v2.app.job.impl.TestJobImpl) Time elapsed: 5.507 sec <<< FAILURE!
      java.lang.AssertionError: expected:<FAIL_ABORT> but was:<FAILED>
      at org.junit.Assert.fail(Assert.java:93)
      at org.junit.Assert.failNotEquals(Assert.java:647)
      at org.junit.Assert.assertEquals(Assert.java:128)
      at org.junit.Assert.assertEquals(Assert.java:147)
      at org.apache.hadoop.mapreduce.v2.app.job.impl.TestJobImpl.assertJobState(TestJobImpl.java:817)
      at org.apache.hadoop.mapreduce.v2.app.job.impl.TestJobImpl.testFailAbortDoesntHang(TestJobImpl.java:418)

      Attachments

        1. mr-5561-1.patch
          0.9 kB
          Karthik Kambatla
        2. org.apache.hadoop.mapreduce.v2.app.job.impl.TestJobImpl-output.txt
          67 kB
          Cindy Li

        Activity

          This comment will be Viewable by All Users Viewable by All Users
          Cancel

          People

            kasha Karthik Kambatla
            cindyli_2012 Cindy Li
            Votes:
            0 Vote for this issue
            Watchers:
            6 Start watching this issue

            Dates

              Created:
              Updated:
              Resolved:

              Issue deployment