Hadoop Map/Reduce
  1. Hadoop Map/Reduce
  2. MAPREDUCE-3621

TestDBJob and TestDataDrivenDBInputFormat ant tests fail

    Details

    • Type: Bug Bug
    • Status: Closed
    • Priority: Major Major
    • Resolution: Fixed
    • Affects Version/s: 0.23.0
    • Fix Version/s: 0.23.3, 2.0.2-alpha
    • Component/s: mrv2
    • Labels:
      None

      Description

      The following mapred ant tests fail and have been failing for a very long time:

      [junit] Running org.apache.hadoop.mapreduce.lib.db.TestDBJob
      [junit] Running org.apache.hadoop.mapreduce.lib.db.TestDataDrivenDBInputFormat

      1. MAPREDUCE-3621.patch
        22 kB
        Thomas Graves
      2. MAPREDUCE-3621.patch
        22 kB
        Ravi Prakash
      3. MAPREDUCE-3621.patch
        22 kB
        Ravi Prakash

        Issue Links

          Activity

          Thomas Graves created issue -
          Hide
          Thomas Graves added a comment -

          It looks like its timing out waiting for the org.hsqldb.Server to shutdown. Don't see any particular reason why. I added a few LOG messages to debug and the test starting passing.

          Show
          Thomas Graves added a comment - It looks like its timing out waiting for the org.hsqldb.Server to shutdown. Don't see any particular reason why. I added a few LOG messages to debug and the test starting passing.
          Hide
          Mahadev konar added a comment -

          Thats a sign of a race condition. Does the test always fail?

          Show
          Mahadev konar added a comment - Thats a sign of a race condition. Does the test always fail?
          Hide
          Thomas Graves added a comment -

          Yeah it always fails without the extra LOG message, and has passed every time with the extra LOG message. I was going to dumping the stacks out to see what is running, thinking perhaps one of the connections to the db isn't closed or something and the LOG message gives it enough time to close before the server shutdown. Just a guess at this point.

          It times out trying to do the server.shutdown();. I haven't done anything with the hsqldb.Server before so if you have ideas, glad to hear them.

          Show
          Thomas Graves added a comment - Yeah it always fails without the extra LOG message, and has passed every time with the extra LOG message. I was going to dumping the stacks out to see what is running, thinking perhaps one of the connections to the db isn't closed or something and the LOG message gives it enough time to close before the server shutdown. Just a guess at this point. It times out trying to do the server.shutdown();. I haven't done anything with the hsqldb.Server before so if you have ideas, glad to hear them.
          Hide
          Thomas Graves added a comment -

          So issue is there is still a DB connection thread around and it gets into a deadlock between the connection thread and the server shutdown in the main thread. The Server shutdown in the main thread gets a lock and waits (presumable for the connections to go away), the connection itself is trying to obtain that same lock to do a print. The connection never goes away so the server shutdown times out.

          Show
          Thomas Graves added a comment - So issue is there is still a DB connection thread around and it gets into a deadlock between the connection thread and the server shutdown in the main thread. The Server shutdown in the main thread gets a lock and waits (presumable for the connections to go away), the connection itself is trying to obtain that same lock to do a print. The connection never goes away so the server shutdown times out.
          Thomas Graves made changes -
          Field Original Value New Value
          Link This issue is duplicated by MAPREDUCE-3984 [ MAPREDUCE-3984 ]
          Hide
          Ravi Prakash added a comment -

          Thanks for the pointer Tom!

          The deadlock in hsqldb seems to have been a known issue with 1.8.0.7. Upgrading hsqldb to 2.0.0 seems to solve the issue. I grepped and nobody else is using hsqldb, so we should be fine with updating this instance of it.

          I have also moved the test from ant to the maven build.

          Can someone please review and commit this?

          Show
          Ravi Prakash added a comment - Thanks for the pointer Tom! The deadlock in hsqldb seems to have been a known issue with 1.8.0.7. Upgrading hsqldb to 2.0.0 seems to solve the issue. I grepped and nobody else is using hsqldb, so we should be fine with updating this instance of it. I have also moved the test from ant to the maven build. Can someone please review and commit this?
          Ravi Prakash made changes -
          Attachment MAPREDUCE-3621.patch [ 12518564 ]
          Ravi Prakash made changes -
          Assignee Ravi Prakash [ raviprak ]
          Ravi Prakash made changes -
          Status Open [ 1 ] Patch Available [ 10002 ]
          Hide
          Hadoop QA added a comment -

          -1 overall. Here are the results of testing the latest attachment
          http://issues.apache.org/jira/secure/attachment/12518564/MAPREDUCE-3621.patch
          against trunk revision .

          +1 @author. The patch does not contain any @author tags.

          +1 tests included. The patch appears to include 8 new or modified tests.

          -1 patch. The patch command could not apply the patch.

          Console output: https://builds.apache.org/job/PreCommit-MAPREDUCE-Build/2062//console

          This message is automatically generated.

          Show
          Hadoop QA added a comment - -1 overall. Here are the results of testing the latest attachment http://issues.apache.org/jira/secure/attachment/12518564/MAPREDUCE-3621.patch against trunk revision . +1 @author. The patch does not contain any @author tags. +1 tests included. The patch appears to include 8 new or modified tests. -1 patch. The patch command could not apply the patch. Console output: https://builds.apache.org/job/PreCommit-MAPREDUCE-Build/2062//console This message is automatically generated.
          Hide
          Ravi Prakash added a comment -

          Splitting out the changes from hadoop-common and hadoop-hdfs

          Can someone please review and commit these?

          Show
          Ravi Prakash added a comment - Splitting out the changes from hadoop-common and hadoop-hdfs Can someone please review and commit these?
          Ravi Prakash made changes -
          Attachment MAPREDUCE-3621.patch [ 12518693 ]
          Ravi Prakash made changes -
          Link This issue relates to HADOOP-8180 [ HADOOP-8180 ]
          Hide
          Ravi Prakash added a comment -

          Filed related JIRAs for pom changes

          Show
          Ravi Prakash added a comment - Filed related JIRAs for pom changes
          Ravi Prakash made changes -
          Link This issue relates to HDFS-3109 [ HDFS-3109 ]
          Hide
          Thomas Graves added a comment -

          reattaching same patch to kick Jenkins.

          Show
          Thomas Graves added a comment - reattaching same patch to kick Jenkins.
          Thomas Graves made changes -
          Attachment MAPREDUCE-3621.patch [ 12521318 ]
          Thomas Graves made changes -
          Fix Version/s 0.23.0 [ 12315570 ]
          Affects Version/s 0.23.0 [ 12315570 ]
          Target Version/s 0.23.0 [ 12315570 ] 0.23.3 [ 12320060 ]
          Hide
          Thomas Graves added a comment -

          Ravi,

          I'm getting an error trying to run TestDBJob, can you please take a look.

          -------------------------------------------------------------------------------
          Tests run: 1, Failures: 0, Errors: 1, Skipped: 0, Time elapsed: 0.602 sec <<< FAILURE!
          testRun(org.apache.hadoop.mapreduce.lib.db.TestDBJob) Time elapsed: 0.555 sec <<< ERROR!
          java.lang.NoSuchFieldError: isList
          at org.hsqldb.lib.OrderedHashSet.<init>(Unknown Source)
          at org.hsqldb.server.ServerProperties.<clinit>(Unknown Source)
          at org.hsqldb.server.ServerConfiguration.newDefaultProperties(Unknown Source)
          at org.hsqldb.server.Server.init(Unknown Source)
          at org.hsqldb.server.Server.<init>(Unknown Source)
          at org.hsqldb.server.Server.<init>(Unknown Source)

          Show
          Thomas Graves added a comment - Ravi, I'm getting an error trying to run TestDBJob, can you please take a look. ------------------------------------------------------------------------------- Tests run: 1, Failures: 0, Errors: 1, Skipped: 0, Time elapsed: 0.602 sec <<< FAILURE! testRun(org.apache.hadoop.mapreduce.lib.db.TestDBJob) Time elapsed: 0.555 sec <<< ERROR! java.lang.NoSuchFieldError: isList at org.hsqldb.lib.OrderedHashSet.<init>(Unknown Source) at org.hsqldb.server.ServerProperties.<clinit>(Unknown Source) at org.hsqldb.server.ServerConfiguration.newDefaultProperties(Unknown Source) at org.hsqldb.server.Server.init(Unknown Source) at org.hsqldb.server.Server.<init>(Unknown Source) at org.hsqldb.server.Server.<init>(Unknown Source)
          Thomas Graves made changes -
          Status Patch Available [ 10002 ] Open [ 1 ]
          Hide
          Hadoop QA added a comment -

          -1 overall. Here are the results of testing the latest attachment
          http://issues.apache.org/jira/secure/attachment/12521318/MAPREDUCE-3621.patch
          against trunk revision .

          +1 @author. The patch does not contain any @author tags.

          +1 tests included. The patch appears to include 8 new or modified tests.

          +1 javadoc. The javadoc tool did not generate any warning messages.

          +1 javac. The applied patch does not increase the total number of javac compiler warnings.

          +1 eclipse:eclipse. The patch built with eclipse:eclipse.

          +1 findbugs. The patch does not introduce any new Findbugs (version 1.3.9) warnings.

          +1 release audit. The applied patch does not increase the total number of release audit warnings.

          -1 core tests. The patch failed these unit tests:
          org.apache.hadoop.mapred.TestJobCounters
          org.apache.hadoop.mapred.TestMiniMRChildTask
          org.apache.hadoop.mapreduce.v2.TestMiniMRProxyUser
          org.apache.hadoop.mapreduce.v2.TestMROldApiJobs
          org.apache.hadoop.mapreduce.TestMapReduceLazyOutput
          org.apache.hadoop.mapreduce.v2.TestSpeculativeExecution
          org.apache.hadoop.mapred.TestJobCleanup
          org.apache.hadoop.mapred.TestReduceFetch
          org.apache.hadoop.mapred.TestReduceFetchFromPartialMem
          org.apache.hadoop.mapreduce.v2.TestMRJobs
          org.apache.hadoop.mapreduce.TestChild
          org.apache.hadoop.mapred.TestLazyOutput
          org.apache.hadoop.mapreduce.v2.TestUberAM
          org.apache.hadoop.mapred.TestMiniMRClientCluster
          org.apache.hadoop.mapreduce.lib.output.TestJobOutputCommitter
          org.apache.hadoop.mapred.TestJobSysDirWithDFS

          +1 contrib tests. The patch passed contrib unit tests.

          Test results: https://builds.apache.org/job/PreCommit-MAPREDUCE-Build/2147//testReport/
          Console output: https://builds.apache.org/job/PreCommit-MAPREDUCE-Build/2147//console

          This message is automatically generated.

          Show
          Hadoop QA added a comment - -1 overall. Here are the results of testing the latest attachment http://issues.apache.org/jira/secure/attachment/12521318/MAPREDUCE-3621.patch against trunk revision . +1 @author. The patch does not contain any @author tags. +1 tests included. The patch appears to include 8 new or modified tests. +1 javadoc. The javadoc tool did not generate any warning messages. +1 javac. The applied patch does not increase the total number of javac compiler warnings. +1 eclipse:eclipse. The patch built with eclipse:eclipse. +1 findbugs. The patch does not introduce any new Findbugs (version 1.3.9) warnings. +1 release audit. The applied patch does not increase the total number of release audit warnings. -1 core tests. The patch failed these unit tests: org.apache.hadoop.mapred.TestJobCounters org.apache.hadoop.mapred.TestMiniMRChildTask org.apache.hadoop.mapreduce.v2.TestMiniMRProxyUser org.apache.hadoop.mapreduce.v2.TestMROldApiJobs org.apache.hadoop.mapreduce.TestMapReduceLazyOutput org.apache.hadoop.mapreduce.v2.TestSpeculativeExecution org.apache.hadoop.mapred.TestJobCleanup org.apache.hadoop.mapred.TestReduceFetch org.apache.hadoop.mapred.TestReduceFetchFromPartialMem org.apache.hadoop.mapreduce.v2.TestMRJobs org.apache.hadoop.mapreduce.TestChild org.apache.hadoop.mapred.TestLazyOutput org.apache.hadoop.mapreduce.v2.TestUberAM org.apache.hadoop.mapred.TestMiniMRClientCluster org.apache.hadoop.mapreduce.lib.output.TestJobOutputCommitter org.apache.hadoop.mapred.TestJobSysDirWithDFS +1 contrib tests. The patch passed contrib unit tests. Test results: https://builds.apache.org/job/PreCommit-MAPREDUCE-Build/2147//testReport/ Console output: https://builds.apache.org/job/PreCommit-MAPREDUCE-Build/2147//console This message is automatically generated.
          Hide
          Thomas Graves added a comment -

          It looks like I also need HADOOP-8180 and to blow away the .m2 directory, then the test passes.

          Show
          Thomas Graves added a comment - It looks like I also need HADOOP-8180 and to blow away the .m2 directory, then the test passes.
          Thomas Graves made changes -
          Status Open [ 1 ] Patch Available [ 10002 ]
          Hide
          Thomas Graves added a comment -

          +1. Thanks Ravi - and thanks for moving those tests over to mrv2 directories! I've committed this to trunk, branch-2, and branch-0.23

          Show
          Thomas Graves added a comment - +1. Thanks Ravi - and thanks for moving those tests over to mrv2 directories! I've committed this to trunk, branch-2, and branch-0.23
          Thomas Graves made changes -
          Status Patch Available [ 10002 ] Resolved [ 5 ]
          Fix Version/s 0.23.3 [ 12320060 ]
          Resolution Fixed [ 1 ]
          Hide
          Hudson added a comment -

          Integrated in Hadoop-Common-trunk-Commit #2007 (See https://builds.apache.org/job/Hadoop-Common-trunk-Commit/2007/)
          MAPREDUCE-3621. TestDBJob and TestDataDrivenDBInputFormat ant tests fail (Ravi Prakash via tgraves) (Revision 1310043)

          Result = SUCCESS
          tgraves : http://svn.apache.org/viewcvs.cgi/?root=Apache-SVN&view=rev&rev=1310043
          Files :

          • /hadoop/common/trunk/hadoop-mapreduce-project/CHANGES.txt
          • /hadoop/common/trunk/hadoop-mapreduce-project/hadoop-mapreduce-client/hadoop-mapreduce-client-jobclient/pom.xml
          • /hadoop/common/trunk/hadoop-mapreduce-project/hadoop-mapreduce-client/hadoop-mapreduce-client-jobclient/src/test/java/org/apache/hadoop/mapreduce/lib/db/TestDataDrivenDBInputFormat.java
          • /hadoop/common/trunk/hadoop-mapreduce-project/hadoop-mapreduce-client/pom.xml
          • /hadoop/common/trunk/hadoop-mapreduce-project/hadoop-mapreduce-examples/pom.xml
          • /hadoop/common/trunk/hadoop-mapreduce-project/hadoop-mapreduce-examples/src/main/java/org/apache/hadoop/examples/DBCountPageView.java
          • /hadoop/common/trunk/hadoop-mapreduce-project/hadoop-mapreduce-examples/src/test/java/org/apache/hadoop/mapreduce
          • /hadoop/common/trunk/hadoop-mapreduce-project/hadoop-mapreduce-examples/src/test/java/org/apache/hadoop/mapreduce/lib
          • /hadoop/common/trunk/hadoop-mapreduce-project/hadoop-mapreduce-examples/src/test/java/org/apache/hadoop/mapreduce/lib/db
          • /hadoop/common/trunk/hadoop-mapreduce-project/hadoop-mapreduce-examples/src/test/java/org/apache/hadoop/mapreduce/lib/db/TestDBJob.java
          • /hadoop/common/trunk/hadoop-mapreduce-project/hadoop-yarn/pom.xml
          • /hadoop/common/trunk/hadoop-mapreduce-project/pom.xml
          • /hadoop/common/trunk/hadoop-mapreduce-project/src/test/mapred/org/apache/hadoop/mapreduce/lib/db/TestDBJob.java
          • /hadoop/common/trunk/hadoop-mapreduce-project/src/test/mapred/org/apache/hadoop/mapreduce/lib/db/TestDataDrivenDBInputFormat.java
          Show
          Hudson added a comment - Integrated in Hadoop-Common-trunk-Commit #2007 (See https://builds.apache.org/job/Hadoop-Common-trunk-Commit/2007/ ) MAPREDUCE-3621 . TestDBJob and TestDataDrivenDBInputFormat ant tests fail (Ravi Prakash via tgraves) (Revision 1310043) Result = SUCCESS tgraves : http://svn.apache.org/viewcvs.cgi/?root=Apache-SVN&view=rev&rev=1310043 Files : /hadoop/common/trunk/hadoop-mapreduce-project/CHANGES.txt /hadoop/common/trunk/hadoop-mapreduce-project/hadoop-mapreduce-client/hadoop-mapreduce-client-jobclient/pom.xml /hadoop/common/trunk/hadoop-mapreduce-project/hadoop-mapreduce-client/hadoop-mapreduce-client-jobclient/src/test/java/org/apache/hadoop/mapreduce/lib/db/TestDataDrivenDBInputFormat.java /hadoop/common/trunk/hadoop-mapreduce-project/hadoop-mapreduce-client/pom.xml /hadoop/common/trunk/hadoop-mapreduce-project/hadoop-mapreduce-examples/pom.xml /hadoop/common/trunk/hadoop-mapreduce-project/hadoop-mapreduce-examples/src/main/java/org/apache/hadoop/examples/DBCountPageView.java /hadoop/common/trunk/hadoop-mapreduce-project/hadoop-mapreduce-examples/src/test/java/org/apache/hadoop/mapreduce /hadoop/common/trunk/hadoop-mapreduce-project/hadoop-mapreduce-examples/src/test/java/org/apache/hadoop/mapreduce/lib /hadoop/common/trunk/hadoop-mapreduce-project/hadoop-mapreduce-examples/src/test/java/org/apache/hadoop/mapreduce/lib/db /hadoop/common/trunk/hadoop-mapreduce-project/hadoop-mapreduce-examples/src/test/java/org/apache/hadoop/mapreduce/lib/db/TestDBJob.java /hadoop/common/trunk/hadoop-mapreduce-project/hadoop-yarn/pom.xml /hadoop/common/trunk/hadoop-mapreduce-project/pom.xml /hadoop/common/trunk/hadoop-mapreduce-project/src/test/mapred/org/apache/hadoop/mapreduce/lib/db/TestDBJob.java /hadoop/common/trunk/hadoop-mapreduce-project/src/test/mapred/org/apache/hadoop/mapreduce/lib/db/TestDataDrivenDBInputFormat.java
          Hide
          Hudson added a comment -

          Integrated in Hadoop-Hdfs-trunk-Commit #2082 (See https://builds.apache.org/job/Hadoop-Hdfs-trunk-Commit/2082/)
          MAPREDUCE-3621. TestDBJob and TestDataDrivenDBInputFormat ant tests fail (Ravi Prakash via tgraves) (Revision 1310043)

          Result = SUCCESS
          tgraves : http://svn.apache.org/viewcvs.cgi/?root=Apache-SVN&view=rev&rev=1310043
          Files :

          • /hadoop/common/trunk/hadoop-mapreduce-project/CHANGES.txt
          • /hadoop/common/trunk/hadoop-mapreduce-project/hadoop-mapreduce-client/hadoop-mapreduce-client-jobclient/pom.xml
          • /hadoop/common/trunk/hadoop-mapreduce-project/hadoop-mapreduce-client/hadoop-mapreduce-client-jobclient/src/test/java/org/apache/hadoop/mapreduce/lib/db/TestDataDrivenDBInputFormat.java
          • /hadoop/common/trunk/hadoop-mapreduce-project/hadoop-mapreduce-client/pom.xml
          • /hadoop/common/trunk/hadoop-mapreduce-project/hadoop-mapreduce-examples/pom.xml
          • /hadoop/common/trunk/hadoop-mapreduce-project/hadoop-mapreduce-examples/src/main/java/org/apache/hadoop/examples/DBCountPageView.java
          • /hadoop/common/trunk/hadoop-mapreduce-project/hadoop-mapreduce-examples/src/test/java/org/apache/hadoop/mapreduce
          • /hadoop/common/trunk/hadoop-mapreduce-project/hadoop-mapreduce-examples/src/test/java/org/apache/hadoop/mapreduce/lib
          • /hadoop/common/trunk/hadoop-mapreduce-project/hadoop-mapreduce-examples/src/test/java/org/apache/hadoop/mapreduce/lib/db
          • /hadoop/common/trunk/hadoop-mapreduce-project/hadoop-mapreduce-examples/src/test/java/org/apache/hadoop/mapreduce/lib/db/TestDBJob.java
          • /hadoop/common/trunk/hadoop-mapreduce-project/hadoop-yarn/pom.xml
          • /hadoop/common/trunk/hadoop-mapreduce-project/pom.xml
          • /hadoop/common/trunk/hadoop-mapreduce-project/src/test/mapred/org/apache/hadoop/mapreduce/lib/db/TestDBJob.java
          • /hadoop/common/trunk/hadoop-mapreduce-project/src/test/mapred/org/apache/hadoop/mapreduce/lib/db/TestDataDrivenDBInputFormat.java
          Show
          Hudson added a comment - Integrated in Hadoop-Hdfs-trunk-Commit #2082 (See https://builds.apache.org/job/Hadoop-Hdfs-trunk-Commit/2082/ ) MAPREDUCE-3621 . TestDBJob and TestDataDrivenDBInputFormat ant tests fail (Ravi Prakash via tgraves) (Revision 1310043) Result = SUCCESS tgraves : http://svn.apache.org/viewcvs.cgi/?root=Apache-SVN&view=rev&rev=1310043 Files : /hadoop/common/trunk/hadoop-mapreduce-project/CHANGES.txt /hadoop/common/trunk/hadoop-mapreduce-project/hadoop-mapreduce-client/hadoop-mapreduce-client-jobclient/pom.xml /hadoop/common/trunk/hadoop-mapreduce-project/hadoop-mapreduce-client/hadoop-mapreduce-client-jobclient/src/test/java/org/apache/hadoop/mapreduce/lib/db/TestDataDrivenDBInputFormat.java /hadoop/common/trunk/hadoop-mapreduce-project/hadoop-mapreduce-client/pom.xml /hadoop/common/trunk/hadoop-mapreduce-project/hadoop-mapreduce-examples/pom.xml /hadoop/common/trunk/hadoop-mapreduce-project/hadoop-mapreduce-examples/src/main/java/org/apache/hadoop/examples/DBCountPageView.java /hadoop/common/trunk/hadoop-mapreduce-project/hadoop-mapreduce-examples/src/test/java/org/apache/hadoop/mapreduce /hadoop/common/trunk/hadoop-mapreduce-project/hadoop-mapreduce-examples/src/test/java/org/apache/hadoop/mapreduce/lib /hadoop/common/trunk/hadoop-mapreduce-project/hadoop-mapreduce-examples/src/test/java/org/apache/hadoop/mapreduce/lib/db /hadoop/common/trunk/hadoop-mapreduce-project/hadoop-mapreduce-examples/src/test/java/org/apache/hadoop/mapreduce/lib/db/TestDBJob.java /hadoop/common/trunk/hadoop-mapreduce-project/hadoop-yarn/pom.xml /hadoop/common/trunk/hadoop-mapreduce-project/pom.xml /hadoop/common/trunk/hadoop-mapreduce-project/src/test/mapred/org/apache/hadoop/mapreduce/lib/db/TestDBJob.java /hadoop/common/trunk/hadoop-mapreduce-project/src/test/mapred/org/apache/hadoop/mapreduce/lib/db/TestDataDrivenDBInputFormat.java
          Hide
          Hudson added a comment -

          Integrated in Hadoop-Mapreduce-trunk-Commit #2020 (See https://builds.apache.org/job/Hadoop-Mapreduce-trunk-Commit/2020/)
          MAPREDUCE-3621. TestDBJob and TestDataDrivenDBInputFormat ant tests fail (Ravi Prakash via tgraves) (Revision 1310043)

          Result = SUCCESS
          tgraves : http://svn.apache.org/viewcvs.cgi/?root=Apache-SVN&view=rev&rev=1310043
          Files :

          • /hadoop/common/trunk/hadoop-mapreduce-project/CHANGES.txt
          • /hadoop/common/trunk/hadoop-mapreduce-project/hadoop-mapreduce-client/hadoop-mapreduce-client-jobclient/pom.xml
          • /hadoop/common/trunk/hadoop-mapreduce-project/hadoop-mapreduce-client/hadoop-mapreduce-client-jobclient/src/test/java/org/apache/hadoop/mapreduce/lib/db/TestDataDrivenDBInputFormat.java
          • /hadoop/common/trunk/hadoop-mapreduce-project/hadoop-mapreduce-client/pom.xml
          • /hadoop/common/trunk/hadoop-mapreduce-project/hadoop-mapreduce-examples/pom.xml
          • /hadoop/common/trunk/hadoop-mapreduce-project/hadoop-mapreduce-examples/src/main/java/org/apache/hadoop/examples/DBCountPageView.java
          • /hadoop/common/trunk/hadoop-mapreduce-project/hadoop-mapreduce-examples/src/test/java/org/apache/hadoop/mapreduce
          • /hadoop/common/trunk/hadoop-mapreduce-project/hadoop-mapreduce-examples/src/test/java/org/apache/hadoop/mapreduce/lib
          • /hadoop/common/trunk/hadoop-mapreduce-project/hadoop-mapreduce-examples/src/test/java/org/apache/hadoop/mapreduce/lib/db
          • /hadoop/common/trunk/hadoop-mapreduce-project/hadoop-mapreduce-examples/src/test/java/org/apache/hadoop/mapreduce/lib/db/TestDBJob.java
          • /hadoop/common/trunk/hadoop-mapreduce-project/hadoop-yarn/pom.xml
          • /hadoop/common/trunk/hadoop-mapreduce-project/pom.xml
          • /hadoop/common/trunk/hadoop-mapreduce-project/src/test/mapred/org/apache/hadoop/mapreduce/lib/db/TestDBJob.java
          • /hadoop/common/trunk/hadoop-mapreduce-project/src/test/mapred/org/apache/hadoop/mapreduce/lib/db/TestDataDrivenDBInputFormat.java
          Show
          Hudson added a comment - Integrated in Hadoop-Mapreduce-trunk-Commit #2020 (See https://builds.apache.org/job/Hadoop-Mapreduce-trunk-Commit/2020/ ) MAPREDUCE-3621 . TestDBJob and TestDataDrivenDBInputFormat ant tests fail (Ravi Prakash via tgraves) (Revision 1310043) Result = SUCCESS tgraves : http://svn.apache.org/viewcvs.cgi/?root=Apache-SVN&view=rev&rev=1310043 Files : /hadoop/common/trunk/hadoop-mapreduce-project/CHANGES.txt /hadoop/common/trunk/hadoop-mapreduce-project/hadoop-mapreduce-client/hadoop-mapreduce-client-jobclient/pom.xml /hadoop/common/trunk/hadoop-mapreduce-project/hadoop-mapreduce-client/hadoop-mapreduce-client-jobclient/src/test/java/org/apache/hadoop/mapreduce/lib/db/TestDataDrivenDBInputFormat.java /hadoop/common/trunk/hadoop-mapreduce-project/hadoop-mapreduce-client/pom.xml /hadoop/common/trunk/hadoop-mapreduce-project/hadoop-mapreduce-examples/pom.xml /hadoop/common/trunk/hadoop-mapreduce-project/hadoop-mapreduce-examples/src/main/java/org/apache/hadoop/examples/DBCountPageView.java /hadoop/common/trunk/hadoop-mapreduce-project/hadoop-mapreduce-examples/src/test/java/org/apache/hadoop/mapreduce /hadoop/common/trunk/hadoop-mapreduce-project/hadoop-mapreduce-examples/src/test/java/org/apache/hadoop/mapreduce/lib /hadoop/common/trunk/hadoop-mapreduce-project/hadoop-mapreduce-examples/src/test/java/org/apache/hadoop/mapreduce/lib/db /hadoop/common/trunk/hadoop-mapreduce-project/hadoop-mapreduce-examples/src/test/java/org/apache/hadoop/mapreduce/lib/db/TestDBJob.java /hadoop/common/trunk/hadoop-mapreduce-project/hadoop-yarn/pom.xml /hadoop/common/trunk/hadoop-mapreduce-project/pom.xml /hadoop/common/trunk/hadoop-mapreduce-project/src/test/mapred/org/apache/hadoop/mapreduce/lib/db/TestDBJob.java /hadoop/common/trunk/hadoop-mapreduce-project/src/test/mapred/org/apache/hadoop/mapreduce/lib/db/TestDataDrivenDBInputFormat.java
          Hide
          Hudson added a comment -

          Integrated in Hadoop-Hdfs-0.23-Build #219 (See https://builds.apache.org/job/Hadoop-Hdfs-0.23-Build/219/)
          merge -r 1310044:1310045 from branch-2. FIXES: MAPREDUCE-3621 (Revision 1310046)

          Result = SUCCESS
          tgraves : http://svn.apache.org/viewcvs.cgi/?root=Apache-SVN&view=rev&rev=1310046
          Files :

          • /hadoop/common/branches/branch-0.23/hadoop-mapreduce-project/CHANGES.txt
          • /hadoop/common/branches/branch-0.23/hadoop-mapreduce-project/hadoop-mapreduce-client/hadoop-mapreduce-client-jobclient/pom.xml
          • /hadoop/common/branches/branch-0.23/hadoop-mapreduce-project/hadoop-mapreduce-client/hadoop-mapreduce-client-jobclient/src/test/java/org/apache/hadoop/mapreduce/lib/db/TestDataDrivenDBInputFormat.java
          • /hadoop/common/branches/branch-0.23/hadoop-mapreduce-project/hadoop-mapreduce-client/pom.xml
          • /hadoop/common/branches/branch-0.23/hadoop-mapreduce-project/hadoop-mapreduce-examples/pom.xml
          • /hadoop/common/branches/branch-0.23/hadoop-mapreduce-project/hadoop-mapreduce-examples/src/main/java/org/apache/hadoop/examples/DBCountPageView.java
          • /hadoop/common/branches/branch-0.23/hadoop-mapreduce-project/hadoop-mapreduce-examples/src/test/java/org/apache/hadoop/mapreduce
          • /hadoop/common/branches/branch-0.23/hadoop-mapreduce-project/hadoop-mapreduce-examples/src/test/java/org/apache/hadoop/mapreduce/lib
          • /hadoop/common/branches/branch-0.23/hadoop-mapreduce-project/hadoop-mapreduce-examples/src/test/java/org/apache/hadoop/mapreduce/lib/db
          • /hadoop/common/branches/branch-0.23/hadoop-mapreduce-project/hadoop-mapreduce-examples/src/test/java/org/apache/hadoop/mapreduce/lib/db/TestDBJob.java
          • /hadoop/common/branches/branch-0.23/hadoop-mapreduce-project/hadoop-yarn/pom.xml
          • /hadoop/common/branches/branch-0.23/hadoop-mapreduce-project/pom.xml
          • /hadoop/common/branches/branch-0.23/hadoop-mapreduce-project/src/test/mapred/org/apache/hadoop/mapreduce/lib/db/TestDBJob.java
          • /hadoop/common/branches/branch-0.23/hadoop-mapreduce-project/src/test/mapred/org/apache/hadoop/mapreduce/lib/db/TestDataDrivenDBInputFormat.java
          Show
          Hudson added a comment - Integrated in Hadoop-Hdfs-0.23-Build #219 (See https://builds.apache.org/job/Hadoop-Hdfs-0.23-Build/219/ ) merge -r 1310044:1310045 from branch-2. FIXES: MAPREDUCE-3621 (Revision 1310046) Result = SUCCESS tgraves : http://svn.apache.org/viewcvs.cgi/?root=Apache-SVN&view=rev&rev=1310046 Files : /hadoop/common/branches/branch-0.23/hadoop-mapreduce-project/CHANGES.txt /hadoop/common/branches/branch-0.23/hadoop-mapreduce-project/hadoop-mapreduce-client/hadoop-mapreduce-client-jobclient/pom.xml /hadoop/common/branches/branch-0.23/hadoop-mapreduce-project/hadoop-mapreduce-client/hadoop-mapreduce-client-jobclient/src/test/java/org/apache/hadoop/mapreduce/lib/db/TestDataDrivenDBInputFormat.java /hadoop/common/branches/branch-0.23/hadoop-mapreduce-project/hadoop-mapreduce-client/pom.xml /hadoop/common/branches/branch-0.23/hadoop-mapreduce-project/hadoop-mapreduce-examples/pom.xml /hadoop/common/branches/branch-0.23/hadoop-mapreduce-project/hadoop-mapreduce-examples/src/main/java/org/apache/hadoop/examples/DBCountPageView.java /hadoop/common/branches/branch-0.23/hadoop-mapreduce-project/hadoop-mapreduce-examples/src/test/java/org/apache/hadoop/mapreduce /hadoop/common/branches/branch-0.23/hadoop-mapreduce-project/hadoop-mapreduce-examples/src/test/java/org/apache/hadoop/mapreduce/lib /hadoop/common/branches/branch-0.23/hadoop-mapreduce-project/hadoop-mapreduce-examples/src/test/java/org/apache/hadoop/mapreduce/lib/db /hadoop/common/branches/branch-0.23/hadoop-mapreduce-project/hadoop-mapreduce-examples/src/test/java/org/apache/hadoop/mapreduce/lib/db/TestDBJob.java /hadoop/common/branches/branch-0.23/hadoop-mapreduce-project/hadoop-yarn/pom.xml /hadoop/common/branches/branch-0.23/hadoop-mapreduce-project/pom.xml /hadoop/common/branches/branch-0.23/hadoop-mapreduce-project/src/test/mapred/org/apache/hadoop/mapreduce/lib/db/TestDBJob.java /hadoop/common/branches/branch-0.23/hadoop-mapreduce-project/src/test/mapred/org/apache/hadoop/mapreduce/lib/db/TestDataDrivenDBInputFormat.java
          Hide
          Hudson added a comment -

          Integrated in Hadoop-Hdfs-trunk #1006 (See https://builds.apache.org/job/Hadoop-Hdfs-trunk/1006/)
          MAPREDUCE-3621. TestDBJob and TestDataDrivenDBInputFormat ant tests fail (Ravi Prakash via tgraves) (Revision 1310043)

          Result = FAILURE
          tgraves : http://svn.apache.org/viewcvs.cgi/?root=Apache-SVN&view=rev&rev=1310043
          Files :

          • /hadoop/common/trunk/hadoop-mapreduce-project/CHANGES.txt
          • /hadoop/common/trunk/hadoop-mapreduce-project/hadoop-mapreduce-client/hadoop-mapreduce-client-jobclient/pom.xml
          • /hadoop/common/trunk/hadoop-mapreduce-project/hadoop-mapreduce-client/hadoop-mapreduce-client-jobclient/src/test/java/org/apache/hadoop/mapreduce/lib/db/TestDataDrivenDBInputFormat.java
          • /hadoop/common/trunk/hadoop-mapreduce-project/hadoop-mapreduce-client/pom.xml
          • /hadoop/common/trunk/hadoop-mapreduce-project/hadoop-mapreduce-examples/pom.xml
          • /hadoop/common/trunk/hadoop-mapreduce-project/hadoop-mapreduce-examples/src/main/java/org/apache/hadoop/examples/DBCountPageView.java
          • /hadoop/common/trunk/hadoop-mapreduce-project/hadoop-mapreduce-examples/src/test/java/org/apache/hadoop/mapreduce
          • /hadoop/common/trunk/hadoop-mapreduce-project/hadoop-mapreduce-examples/src/test/java/org/apache/hadoop/mapreduce/lib
          • /hadoop/common/trunk/hadoop-mapreduce-project/hadoop-mapreduce-examples/src/test/java/org/apache/hadoop/mapreduce/lib/db
          • /hadoop/common/trunk/hadoop-mapreduce-project/hadoop-mapreduce-examples/src/test/java/org/apache/hadoop/mapreduce/lib/db/TestDBJob.java
          • /hadoop/common/trunk/hadoop-mapreduce-project/hadoop-yarn/pom.xml
          • /hadoop/common/trunk/hadoop-mapreduce-project/pom.xml
          • /hadoop/common/trunk/hadoop-mapreduce-project/src/test/mapred/org/apache/hadoop/mapreduce/lib/db/TestDBJob.java
          • /hadoop/common/trunk/hadoop-mapreduce-project/src/test/mapred/org/apache/hadoop/mapreduce/lib/db/TestDataDrivenDBInputFormat.java
          Show
          Hudson added a comment - Integrated in Hadoop-Hdfs-trunk #1006 (See https://builds.apache.org/job/Hadoop-Hdfs-trunk/1006/ ) MAPREDUCE-3621 . TestDBJob and TestDataDrivenDBInputFormat ant tests fail (Ravi Prakash via tgraves) (Revision 1310043) Result = FAILURE tgraves : http://svn.apache.org/viewcvs.cgi/?root=Apache-SVN&view=rev&rev=1310043 Files : /hadoop/common/trunk/hadoop-mapreduce-project/CHANGES.txt /hadoop/common/trunk/hadoop-mapreduce-project/hadoop-mapreduce-client/hadoop-mapreduce-client-jobclient/pom.xml /hadoop/common/trunk/hadoop-mapreduce-project/hadoop-mapreduce-client/hadoop-mapreduce-client-jobclient/src/test/java/org/apache/hadoop/mapreduce/lib/db/TestDataDrivenDBInputFormat.java /hadoop/common/trunk/hadoop-mapreduce-project/hadoop-mapreduce-client/pom.xml /hadoop/common/trunk/hadoop-mapreduce-project/hadoop-mapreduce-examples/pom.xml /hadoop/common/trunk/hadoop-mapreduce-project/hadoop-mapreduce-examples/src/main/java/org/apache/hadoop/examples/DBCountPageView.java /hadoop/common/trunk/hadoop-mapreduce-project/hadoop-mapreduce-examples/src/test/java/org/apache/hadoop/mapreduce /hadoop/common/trunk/hadoop-mapreduce-project/hadoop-mapreduce-examples/src/test/java/org/apache/hadoop/mapreduce/lib /hadoop/common/trunk/hadoop-mapreduce-project/hadoop-mapreduce-examples/src/test/java/org/apache/hadoop/mapreduce/lib/db /hadoop/common/trunk/hadoop-mapreduce-project/hadoop-mapreduce-examples/src/test/java/org/apache/hadoop/mapreduce/lib/db/TestDBJob.java /hadoop/common/trunk/hadoop-mapreduce-project/hadoop-yarn/pom.xml /hadoop/common/trunk/hadoop-mapreduce-project/pom.xml /hadoop/common/trunk/hadoop-mapreduce-project/src/test/mapred/org/apache/hadoop/mapreduce/lib/db/TestDBJob.java /hadoop/common/trunk/hadoop-mapreduce-project/src/test/mapred/org/apache/hadoop/mapreduce/lib/db/TestDataDrivenDBInputFormat.java
          Hide
          Hudson added a comment -

          Integrated in Hadoop-Mapreduce-trunk #1041 (See https://builds.apache.org/job/Hadoop-Mapreduce-trunk/1041/)
          MAPREDUCE-3621. TestDBJob and TestDataDrivenDBInputFormat ant tests fail (Ravi Prakash via tgraves) (Revision 1310043)

          Result = SUCCESS
          tgraves : http://svn.apache.org/viewcvs.cgi/?root=Apache-SVN&view=rev&rev=1310043
          Files :

          • /hadoop/common/trunk/hadoop-mapreduce-project/CHANGES.txt
          • /hadoop/common/trunk/hadoop-mapreduce-project/hadoop-mapreduce-client/hadoop-mapreduce-client-jobclient/pom.xml
          • /hadoop/common/trunk/hadoop-mapreduce-project/hadoop-mapreduce-client/hadoop-mapreduce-client-jobclient/src/test/java/org/apache/hadoop/mapreduce/lib/db/TestDataDrivenDBInputFormat.java
          • /hadoop/common/trunk/hadoop-mapreduce-project/hadoop-mapreduce-client/pom.xml
          • /hadoop/common/trunk/hadoop-mapreduce-project/hadoop-mapreduce-examples/pom.xml
          • /hadoop/common/trunk/hadoop-mapreduce-project/hadoop-mapreduce-examples/src/main/java/org/apache/hadoop/examples/DBCountPageView.java
          • /hadoop/common/trunk/hadoop-mapreduce-project/hadoop-mapreduce-examples/src/test/java/org/apache/hadoop/mapreduce
          • /hadoop/common/trunk/hadoop-mapreduce-project/hadoop-mapreduce-examples/src/test/java/org/apache/hadoop/mapreduce/lib
          • /hadoop/common/trunk/hadoop-mapreduce-project/hadoop-mapreduce-examples/src/test/java/org/apache/hadoop/mapreduce/lib/db
          • /hadoop/common/trunk/hadoop-mapreduce-project/hadoop-mapreduce-examples/src/test/java/org/apache/hadoop/mapreduce/lib/db/TestDBJob.java
          • /hadoop/common/trunk/hadoop-mapreduce-project/hadoop-yarn/pom.xml
          • /hadoop/common/trunk/hadoop-mapreduce-project/pom.xml
          • /hadoop/common/trunk/hadoop-mapreduce-project/src/test/mapred/org/apache/hadoop/mapreduce/lib/db/TestDBJob.java
          • /hadoop/common/trunk/hadoop-mapreduce-project/src/test/mapred/org/apache/hadoop/mapreduce/lib/db/TestDataDrivenDBInputFormat.java
          Show
          Hudson added a comment - Integrated in Hadoop-Mapreduce-trunk #1041 (See https://builds.apache.org/job/Hadoop-Mapreduce-trunk/1041/ ) MAPREDUCE-3621 . TestDBJob and TestDataDrivenDBInputFormat ant tests fail (Ravi Prakash via tgraves) (Revision 1310043) Result = SUCCESS tgraves : http://svn.apache.org/viewcvs.cgi/?root=Apache-SVN&view=rev&rev=1310043 Files : /hadoop/common/trunk/hadoop-mapreduce-project/CHANGES.txt /hadoop/common/trunk/hadoop-mapreduce-project/hadoop-mapreduce-client/hadoop-mapreduce-client-jobclient/pom.xml /hadoop/common/trunk/hadoop-mapreduce-project/hadoop-mapreduce-client/hadoop-mapreduce-client-jobclient/src/test/java/org/apache/hadoop/mapreduce/lib/db/TestDataDrivenDBInputFormat.java /hadoop/common/trunk/hadoop-mapreduce-project/hadoop-mapreduce-client/pom.xml /hadoop/common/trunk/hadoop-mapreduce-project/hadoop-mapreduce-examples/pom.xml /hadoop/common/trunk/hadoop-mapreduce-project/hadoop-mapreduce-examples/src/main/java/org/apache/hadoop/examples/DBCountPageView.java /hadoop/common/trunk/hadoop-mapreduce-project/hadoop-mapreduce-examples/src/test/java/org/apache/hadoop/mapreduce /hadoop/common/trunk/hadoop-mapreduce-project/hadoop-mapreduce-examples/src/test/java/org/apache/hadoop/mapreduce/lib /hadoop/common/trunk/hadoop-mapreduce-project/hadoop-mapreduce-examples/src/test/java/org/apache/hadoop/mapreduce/lib/db /hadoop/common/trunk/hadoop-mapreduce-project/hadoop-mapreduce-examples/src/test/java/org/apache/hadoop/mapreduce/lib/db/TestDBJob.java /hadoop/common/trunk/hadoop-mapreduce-project/hadoop-yarn/pom.xml /hadoop/common/trunk/hadoop-mapreduce-project/pom.xml /hadoop/common/trunk/hadoop-mapreduce-project/src/test/mapred/org/apache/hadoop/mapreduce/lib/db/TestDBJob.java /hadoop/common/trunk/hadoop-mapreduce-project/src/test/mapred/org/apache/hadoop/mapreduce/lib/db/TestDataDrivenDBInputFormat.java
          Arun C Murthy made changes -
          Fix Version/s 2.0.2-alpha [ 12322471 ]
          Arun C Murthy made changes -
          Status Resolved [ 5 ] Closed [ 6 ]
          Transition Time In Source Status Execution Times Last Executer Last Execution Date
          Patch Available Patch Available Open Open
          19d 16h 44m 1 Thomas Graves 04/Apr/12 16:37
          Open Open Patch Available Patch Available
          71d 5h 9m 2 Thomas Graves 05/Apr/12 14:10
          Patch Available Patch Available Resolved Resolved
          7h 4m 1 Thomas Graves 05/Apr/12 21:15
          Resolved Resolved Closed Closed
          188d 21h 33m 1 Arun C Murthy 11/Oct/12 18:48

            People

            • Assignee:
              Ravi Prakash
              Reporter:
              Thomas Graves
            • Votes:
              0 Vote for this issue
              Watchers:
              3 Start watching this issue

              Dates

              • Created:
                Updated:
                Resolved:

                Development