Details

    • Type: Bug Bug
    • Status: Closed
    • Priority: Blocker Blocker
    • Resolution: Fixed
    • Affects Version/s: 0.23.1, 0.24.0
    • Fix Version/s: 0.23.1
    • Component/s: contrib/streaming, mrv2
    • Labels:
      None

      Description

      After Mavenizing streaming and getting its testcases to use the MiniMRCluster wrapper (MAPREDUCE-3169), 4 testcases fail to pass.

      Following is an assessment of those failures. Note that the testcases have been tweaked only to set the streaming JAR and yarn as the framework.

      (If these issues are unrelated we should create sub-tasks for each one of them).

      TestStreamingCombiner, fails because returned counters don't match assertion. However, counters printed in the test output indicate values that would satisfy the assertion. As Tom has indicated it seems MR/YARN are not passing back counter information to the client API.

      TestStreamingBadRecords, the job is failing with the following exception

      Application application_1321575850006_0001 failed 1 times due to AM Container for 
      appattempt_1321575850006_0001_000001 exited with  exitCode: 127 due to: 
      .Failing this attempt.. Failing the application.
      

      Difficult to troubleshoot because there are not task logs from Mini MR/YARN run.

      TestStreamingStatus fails in validateTaskStatus() in the following assertion

      expected:<[before consuming input > sort]> but was:<[SUCCEEDED]>
      

      TestUlimit fails with

      org.junit.ComparisonFailure: output is wrong expected:<[786432]> but was:<[unlimited]>
      

        Issue Links

          Activity

          Hide
          Alejandro Abdelnur added a comment -

          The tests failing are excluded in the streaming POM, once fixed they should be removed from the exclusion list.

          Show
          Alejandro Abdelnur added a comment - The tests failing are excluded in the streaming POM, once fixed they should be removed from the exclusion list.
          Hide
          Jonathan Eagles added a comment -

          TestStreamingStatus issue is the same as MAPREDUCE-3409

          Show
          Jonathan Eagles added a comment - TestStreamingStatus issue is the same as MAPREDUCE-3409
          Hide
          Mahadev konar added a comment -

          I am also seeing:

          Running org.apache.hadoop.streaming.TestFileArgs
          Tests run: 1, Failures: 1, Errors: 0, Skipped: 0, Time elapsed: 13.199 sec <<< FAILURE!
          
          Running org.apache.hadoop.streaming.TestMultipleArchiveFiles
          Tests run: 1, Failures: 1, Errors: 0, Skipped: 0, Time elapsed: 12.5 sec <<< FAILURE!
          Running org.apache.hadoop.streaming.TestMultipleCachefiles
          Tests run: 1, Failures: 0, Errors: 1, Skipped: 0, Time elapsed: 23.23 sec <<< FAILURE!
          
          
          Running org.apache.hadoop.streaming.TestStreamingTaskLog
          Tests run: 1, Failures: 1, Errors: 0, Skipped: 0, Time elapsed: 11.249 sec <<< FAILURE!
          
          
          Running org.apache.hadoop.streaming.TestSymLink  
          Tests run: 1, Failures: 0, Errors: 1, Skipped: 0, Time elapsed: 13.203 sec <<< FAILURE!
          
          
          Show
          Mahadev konar added a comment - I am also seeing: Running org.apache.hadoop.streaming.TestFileArgs Tests run: 1, Failures: 1, Errors: 0, Skipped: 0, Time elapsed: 13.199 sec <<< FAILURE! Running org.apache.hadoop.streaming.TestMultipleArchiveFiles Tests run: 1, Failures: 1, Errors: 0, Skipped: 0, Time elapsed: 12.5 sec <<< FAILURE! Running org.apache.hadoop.streaming.TestMultipleCachefiles Tests run: 1, Failures: 0, Errors: 1, Skipped: 0, Time elapsed: 23.23 sec <<< FAILURE! Running org.apache.hadoop.streaming.TestStreamingTaskLog Tests run: 1, Failures: 1, Errors: 0, Skipped: 0, Time elapsed: 11.249 sec <<< FAILURE! Running org.apache.hadoop.streaming.TestSymLink Tests run: 1, Failures: 0, Errors: 1, Skipped: 0, Time elapsed: 13.203 sec <<< FAILURE!
          Hide
          Alejandro Abdelnur added a comment -

          Mahadev,

          the tests you are see failing, those were tweaked and passing with HADOOP-7590. Would you check if any of those changes have been mistakenly reverted?

          Show
          Alejandro Abdelnur added a comment - Mahadev, the tests you are see failing, those were tweaked and passing with HADOOP-7590 . Would you check if any of those changes have been mistakenly reverted?
          Hide
          Hitesh Shah added a comment -

          @Mahadev, those tests should likely work if JAVA_HOME is set in your environment.

          Show
          Hitesh Shah added a comment - @Mahadev, those tests should likely work if JAVA_HOME is set in your environment.
          Hide
          Hitesh Shah added a comment -

          I think TestStreamingBadRecords is failing because the container launch is not handling special chars when generating/executing the launch container shell script.

          launchContainer: [bash, -c, /Users/Hitesh/dev/hadoop-common/hadoop-tools/hadoop-streaming/target/org.apache.hadoop.mapred.ClusterMapReduceTestCase$ConfigurableMiniMRCluster/org.apache.hadoop.mapred.ClusterMapReduceTestCase$ConfigurableMiniMRCluster-localDir-nm-1_2/usercache/Hitesh/appcache/application_1327200233613_0001/container_1327200233613_0001_01_000001/default_container_executor.sh]

          Will file a separate jira for that.

          Show
          Hitesh Shah added a comment - I think TestStreamingBadRecords is failing because the container launch is not handling special chars when generating/executing the launch container shell script. launchContainer: [bash, -c, /Users/Hitesh/dev/hadoop-common/hadoop-tools/hadoop-streaming/target/org.apache.hadoop.mapred.ClusterMapReduceTestCase$ConfigurableMiniMRCluster/org.apache.hadoop.mapred.ClusterMapReduceTestCase$ConfigurableMiniMRCluster-localDir-nm-1_2/usercache/Hitesh/appcache/application_1327200233613_0001/container_1327200233613_0001_01_000001/default_container_executor.sh] Will file a separate jira for that.
          Hide
          Hitesh Shah added a comment -

          TestUlimit seems to be failing as ulimit is not supported in mrv2. Likewise for StreamingBadRecords as skipping bad records is also not supported.

          Will open a separate jira for the above with respect to either cleaning up the configuration settings or more clearly documenting which configs are not supported. Will provide a patch shortly for commenting out the tests - depending on whether ulimit or skip bad records will/will not be supported, the test files could just be removed from svn.

          TestStreamingCombiner seems to work in my local env. Anyone else still seeing it fail?

          Show
          Hitesh Shah added a comment - TestUlimit seems to be failing as ulimit is not supported in mrv2. Likewise for StreamingBadRecords as skipping bad records is also not supported. Will open a separate jira for the above with respect to either cleaning up the configuration settings or more clearly documenting which configs are not supported. Will provide a patch shortly for commenting out the tests - depending on whether ulimit or skip bad records will/will not be supported, the test files could just be removed from svn. TestStreamingCombiner seems to work in my local env. Anyone else still seeing it fail?
          Hide
          Hitesh Shah added a comment -

          Patch to comment out testulimit and teststreamingbadrecords tests.

          Show
          Hitesh Shah added a comment - Patch to comment out testulimit and teststreamingbadrecords tests.
          Hide
          Hadoop QA added a comment -

          -1 overall. Here are the results of testing the latest attachment
          http://issues.apache.org/jira/secure/attachment/12512679/MR-3427.1.patch
          against trunk revision .

          +1 @author. The patch does not contain any @author tags.

          +1 tests included. The patch appears to include 8 new or modified tests.

          -1 patch. The patch command could not apply the patch.

          Console output: https://builds.apache.org/job/PreCommit-MAPREDUCE-Build/1730//console

          This message is automatically generated.

          Show
          Hadoop QA added a comment - -1 overall. Here are the results of testing the latest attachment http://issues.apache.org/jira/secure/attachment/12512679/MR-3427.1.patch against trunk revision . +1 @author. The patch does not contain any @author tags. +1 tests included. The patch appears to include 8 new or modified tests. -1 patch. The patch command could not apply the patch. Console output: https://builds.apache.org/job/PreCommit-MAPREDUCE-Build/1730//console This message is automatically generated.
          Hide
          Arun C Murthy added a comment -

          Hitesh, just use @Ignore for the tests?

          Show
          Arun C Murthy added a comment - Hitesh, just use @Ignore for the tests?
          Hide
          Hitesh Shah added a comment -

          @Arun - the patch does use @Ignore for the ones that use junit annotations. For TestStreamingBadRecords that derives off another class ( which in turn extends TestCase ), I had to comment out the tests themselves.

          Show
          Hitesh Shah added a comment - @Arun - the patch does use @Ignore for the ones that use junit annotations. For TestStreamingBadRecords that derives off another class ( which in turn extends TestCase ), I had to comment out the tests themselves.
          Hide
          Arun C Murthy added a comment -

          Got it, +1.

          Show
          Arun C Murthy added a comment - Got it, +1.
          Hide
          Arun C Murthy added a comment -

          I just committed this. Thanks Hitesh!

          Show
          Arun C Murthy added a comment - I just committed this. Thanks Hitesh!
          Hide
          Hudson added a comment -

          Integrated in Hadoop-Hdfs-trunk-Commit #1707 (See https://builds.apache.org/job/Hadoop-Hdfs-trunk-Commit/1707/)
          MAPREDUCE-3427. Fix streaming unit tests broken after mavenization. Contributed by Hitesh Shah.

          acmurthy : http://svn.apache.org/viewcvs.cgi/?root=Apache-SVN&view=rev&rev=1239391
          Files :

          • /hadoop/common/trunk/hadoop-mapreduce-project/CHANGES.txt
          • /hadoop/common/trunk/hadoop-tools/hadoop-streaming/pom.xml
          • /hadoop/common/trunk/hadoop-tools/hadoop-streaming/src/test/java/org/apache/hadoop/streaming/TestStreamingBadRecords.java
          • /hadoop/common/trunk/hadoop-tools/hadoop-streaming/src/test/java/org/apache/hadoop/streaming/TestUlimit.java
          Show
          Hudson added a comment - Integrated in Hadoop-Hdfs-trunk-Commit #1707 (See https://builds.apache.org/job/Hadoop-Hdfs-trunk-Commit/1707/ ) MAPREDUCE-3427 . Fix streaming unit tests broken after mavenization. Contributed by Hitesh Shah. acmurthy : http://svn.apache.org/viewcvs.cgi/?root=Apache-SVN&view=rev&rev=1239391 Files : /hadoop/common/trunk/hadoop-mapreduce-project/CHANGES.txt /hadoop/common/trunk/hadoop-tools/hadoop-streaming/pom.xml /hadoop/common/trunk/hadoop-tools/hadoop-streaming/src/test/java/org/apache/hadoop/streaming/TestStreamingBadRecords.java /hadoop/common/trunk/hadoop-tools/hadoop-streaming/src/test/java/org/apache/hadoop/streaming/TestUlimit.java
          Hide
          Hudson added a comment -

          Integrated in Hadoop-Mapreduce-0.23-Commit #478 (See https://builds.apache.org/job/Hadoop-Mapreduce-0.23-Commit/478/)
          Merge -c 1239391 from trunk to branch-0.23 to fix MAPREDUCE-3427. Fix streaming unit tests broken after mavenization.

          acmurthy : http://svn.apache.org/viewcvs.cgi/?root=Apache-SVN&view=rev&rev=1239392
          Files :

          • /hadoop/common/branches/branch-0.23/hadoop-mapreduce-project/CHANGES.txt
          • /hadoop/common/branches/branch-0.23/hadoop-tools/hadoop-streaming/pom.xml
          • /hadoop/common/branches/branch-0.23/hadoop-tools/hadoop-streaming/src/test/java/org/apache/hadoop/streaming/TestStreamingBadRecords.java
          • /hadoop/common/branches/branch-0.23/hadoop-tools/hadoop-streaming/src/test/java/org/apache/hadoop/streaming/TestUlimit.java
          Show
          Hudson added a comment - Integrated in Hadoop-Mapreduce-0.23-Commit #478 (See https://builds.apache.org/job/Hadoop-Mapreduce-0.23-Commit/478/ ) Merge -c 1239391 from trunk to branch-0.23 to fix MAPREDUCE-3427 . Fix streaming unit tests broken after mavenization. acmurthy : http://svn.apache.org/viewcvs.cgi/?root=Apache-SVN&view=rev&rev=1239392 Files : /hadoop/common/branches/branch-0.23/hadoop-mapreduce-project/CHANGES.txt /hadoop/common/branches/branch-0.23/hadoop-tools/hadoop-streaming/pom.xml /hadoop/common/branches/branch-0.23/hadoop-tools/hadoop-streaming/src/test/java/org/apache/hadoop/streaming/TestStreamingBadRecords.java /hadoop/common/branches/branch-0.23/hadoop-tools/hadoop-streaming/src/test/java/org/apache/hadoop/streaming/TestUlimit.java
          Hide
          Hudson added a comment -

          Integrated in Hadoop-Common-0.23-Commit #464 (See https://builds.apache.org/job/Hadoop-Common-0.23-Commit/464/)
          Merge -c 1239391 from trunk to branch-0.23 to fix MAPREDUCE-3427. Fix streaming unit tests broken after mavenization.

          acmurthy : http://svn.apache.org/viewcvs.cgi/?root=Apache-SVN&view=rev&rev=1239392
          Files :

          • /hadoop/common/branches/branch-0.23/hadoop-mapreduce-project/CHANGES.txt
          • /hadoop/common/branches/branch-0.23/hadoop-tools/hadoop-streaming/pom.xml
          • /hadoop/common/branches/branch-0.23/hadoop-tools/hadoop-streaming/src/test/java/org/apache/hadoop/streaming/TestStreamingBadRecords.java
          • /hadoop/common/branches/branch-0.23/hadoop-tools/hadoop-streaming/src/test/java/org/apache/hadoop/streaming/TestUlimit.java
          Show
          Hudson added a comment - Integrated in Hadoop-Common-0.23-Commit #464 (See https://builds.apache.org/job/Hadoop-Common-0.23-Commit/464/ ) Merge -c 1239391 from trunk to branch-0.23 to fix MAPREDUCE-3427 . Fix streaming unit tests broken after mavenization. acmurthy : http://svn.apache.org/viewcvs.cgi/?root=Apache-SVN&view=rev&rev=1239392 Files : /hadoop/common/branches/branch-0.23/hadoop-mapreduce-project/CHANGES.txt /hadoop/common/branches/branch-0.23/hadoop-tools/hadoop-streaming/pom.xml /hadoop/common/branches/branch-0.23/hadoop-tools/hadoop-streaming/src/test/java/org/apache/hadoop/streaming/TestStreamingBadRecords.java /hadoop/common/branches/branch-0.23/hadoop-tools/hadoop-streaming/src/test/java/org/apache/hadoop/streaming/TestUlimit.java
          Hide
          Hudson added a comment -

          Integrated in Hadoop-Hdfs-0.23-Commit #454 (See https://builds.apache.org/job/Hadoop-Hdfs-0.23-Commit/454/)
          Merge -c 1239391 from trunk to branch-0.23 to fix MAPREDUCE-3427. Fix streaming unit tests broken after mavenization.

          acmurthy : http://svn.apache.org/viewcvs.cgi/?root=Apache-SVN&view=rev&rev=1239392
          Files :

          • /hadoop/common/branches/branch-0.23/hadoop-mapreduce-project/CHANGES.txt
          • /hadoop/common/branches/branch-0.23/hadoop-tools/hadoop-streaming/pom.xml
          • /hadoop/common/branches/branch-0.23/hadoop-tools/hadoop-streaming/src/test/java/org/apache/hadoop/streaming/TestStreamingBadRecords.java
          • /hadoop/common/branches/branch-0.23/hadoop-tools/hadoop-streaming/src/test/java/org/apache/hadoop/streaming/TestUlimit.java
          Show
          Hudson added a comment - Integrated in Hadoop-Hdfs-0.23-Commit #454 (See https://builds.apache.org/job/Hadoop-Hdfs-0.23-Commit/454/ ) Merge -c 1239391 from trunk to branch-0.23 to fix MAPREDUCE-3427 . Fix streaming unit tests broken after mavenization. acmurthy : http://svn.apache.org/viewcvs.cgi/?root=Apache-SVN&view=rev&rev=1239392 Files : /hadoop/common/branches/branch-0.23/hadoop-mapreduce-project/CHANGES.txt /hadoop/common/branches/branch-0.23/hadoop-tools/hadoop-streaming/pom.xml /hadoop/common/branches/branch-0.23/hadoop-tools/hadoop-streaming/src/test/java/org/apache/hadoop/streaming/TestStreamingBadRecords.java /hadoop/common/branches/branch-0.23/hadoop-tools/hadoop-streaming/src/test/java/org/apache/hadoop/streaming/TestUlimit.java
          Hide
          Hudson added a comment -

          Integrated in Hadoop-Common-trunk-Commit #1637 (See https://builds.apache.org/job/Hadoop-Common-trunk-Commit/1637/)
          MAPREDUCE-3427. Fix streaming unit tests broken after mavenization. Contributed by Hitesh Shah.

          acmurthy : http://svn.apache.org/viewcvs.cgi/?root=Apache-SVN&view=rev&rev=1239391
          Files :

          • /hadoop/common/trunk/hadoop-mapreduce-project/CHANGES.txt
          • /hadoop/common/trunk/hadoop-tools/hadoop-streaming/pom.xml
          • /hadoop/common/trunk/hadoop-tools/hadoop-streaming/src/test/java/org/apache/hadoop/streaming/TestStreamingBadRecords.java
          • /hadoop/common/trunk/hadoop-tools/hadoop-streaming/src/test/java/org/apache/hadoop/streaming/TestUlimit.java
          Show
          Hudson added a comment - Integrated in Hadoop-Common-trunk-Commit #1637 (See https://builds.apache.org/job/Hadoop-Common-trunk-Commit/1637/ ) MAPREDUCE-3427 . Fix streaming unit tests broken after mavenization. Contributed by Hitesh Shah. acmurthy : http://svn.apache.org/viewcvs.cgi/?root=Apache-SVN&view=rev&rev=1239391 Files : /hadoop/common/trunk/hadoop-mapreduce-project/CHANGES.txt /hadoop/common/trunk/hadoop-tools/hadoop-streaming/pom.xml /hadoop/common/trunk/hadoop-tools/hadoop-streaming/src/test/java/org/apache/hadoop/streaming/TestStreamingBadRecords.java /hadoop/common/trunk/hadoop-tools/hadoop-streaming/src/test/java/org/apache/hadoop/streaming/TestUlimit.java
          Hide
          Hudson added a comment -

          Integrated in Hadoop-Mapreduce-trunk-Commit #1653 (See https://builds.apache.org/job/Hadoop-Mapreduce-trunk-Commit/1653/)
          MAPREDUCE-3427. Fix streaming unit tests broken after mavenization. Contributed by Hitesh Shah.

          acmurthy : http://svn.apache.org/viewcvs.cgi/?root=Apache-SVN&view=rev&rev=1239391
          Files :

          • /hadoop/common/trunk/hadoop-mapreduce-project/CHANGES.txt
          • /hadoop/common/trunk/hadoop-tools/hadoop-streaming/pom.xml
          • /hadoop/common/trunk/hadoop-tools/hadoop-streaming/src/test/java/org/apache/hadoop/streaming/TestStreamingBadRecords.java
          • /hadoop/common/trunk/hadoop-tools/hadoop-streaming/src/test/java/org/apache/hadoop/streaming/TestUlimit.java
          Show
          Hudson added a comment - Integrated in Hadoop-Mapreduce-trunk-Commit #1653 (See https://builds.apache.org/job/Hadoop-Mapreduce-trunk-Commit/1653/ ) MAPREDUCE-3427 . Fix streaming unit tests broken after mavenization. Contributed by Hitesh Shah. acmurthy : http://svn.apache.org/viewcvs.cgi/?root=Apache-SVN&view=rev&rev=1239391 Files : /hadoop/common/trunk/hadoop-mapreduce-project/CHANGES.txt /hadoop/common/trunk/hadoop-tools/hadoop-streaming/pom.xml /hadoop/common/trunk/hadoop-tools/hadoop-streaming/src/test/java/org/apache/hadoop/streaming/TestStreamingBadRecords.java /hadoop/common/trunk/hadoop-tools/hadoop-streaming/src/test/java/org/apache/hadoop/streaming/TestUlimit.java
          Hide
          Hudson added a comment -

          Integrated in Hadoop-Hdfs-trunk #944 (See https://builds.apache.org/job/Hadoop-Hdfs-trunk/944/)
          MAPREDUCE-3427. Fix streaming unit tests broken after mavenization. Contributed by Hitesh Shah.

          acmurthy : http://svn.apache.org/viewcvs.cgi/?root=Apache-SVN&view=rev&rev=1239391
          Files :

          • /hadoop/common/trunk/hadoop-mapreduce-project/CHANGES.txt
          • /hadoop/common/trunk/hadoop-tools/hadoop-streaming/pom.xml
          • /hadoop/common/trunk/hadoop-tools/hadoop-streaming/src/test/java/org/apache/hadoop/streaming/TestStreamingBadRecords.java
          • /hadoop/common/trunk/hadoop-tools/hadoop-streaming/src/test/java/org/apache/hadoop/streaming/TestUlimit.java
          Show
          Hudson added a comment - Integrated in Hadoop-Hdfs-trunk #944 (See https://builds.apache.org/job/Hadoop-Hdfs-trunk/944/ ) MAPREDUCE-3427 . Fix streaming unit tests broken after mavenization. Contributed by Hitesh Shah. acmurthy : http://svn.apache.org/viewcvs.cgi/?root=Apache-SVN&view=rev&rev=1239391 Files : /hadoop/common/trunk/hadoop-mapreduce-project/CHANGES.txt /hadoop/common/trunk/hadoop-tools/hadoop-streaming/pom.xml /hadoop/common/trunk/hadoop-tools/hadoop-streaming/src/test/java/org/apache/hadoop/streaming/TestStreamingBadRecords.java /hadoop/common/trunk/hadoop-tools/hadoop-streaming/src/test/java/org/apache/hadoop/streaming/TestUlimit.java
          Hide
          Hudson added a comment -

          Integrated in Hadoop-Hdfs-0.23-Build #157 (See https://builds.apache.org/job/Hadoop-Hdfs-0.23-Build/157/)
          Merge -c 1239391 from trunk to branch-0.23 to fix MAPREDUCE-3427. Fix streaming unit tests broken after mavenization.

          acmurthy : http://svn.apache.org/viewcvs.cgi/?root=Apache-SVN&view=rev&rev=1239392
          Files :

          • /hadoop/common/branches/branch-0.23/hadoop-mapreduce-project/CHANGES.txt
          • /hadoop/common/branches/branch-0.23/hadoop-tools/hadoop-streaming/pom.xml
          • /hadoop/common/branches/branch-0.23/hadoop-tools/hadoop-streaming/src/test/java/org/apache/hadoop/streaming/TestStreamingBadRecords.java
          • /hadoop/common/branches/branch-0.23/hadoop-tools/hadoop-streaming/src/test/java/org/apache/hadoop/streaming/TestUlimit.java
          Show
          Hudson added a comment - Integrated in Hadoop-Hdfs-0.23-Build #157 (See https://builds.apache.org/job/Hadoop-Hdfs-0.23-Build/157/ ) Merge -c 1239391 from trunk to branch-0.23 to fix MAPREDUCE-3427 . Fix streaming unit tests broken after mavenization. acmurthy : http://svn.apache.org/viewcvs.cgi/?root=Apache-SVN&view=rev&rev=1239392 Files : /hadoop/common/branches/branch-0.23/hadoop-mapreduce-project/CHANGES.txt /hadoop/common/branches/branch-0.23/hadoop-tools/hadoop-streaming/pom.xml /hadoop/common/branches/branch-0.23/hadoop-tools/hadoop-streaming/src/test/java/org/apache/hadoop/streaming/TestStreamingBadRecords.java /hadoop/common/branches/branch-0.23/hadoop-tools/hadoop-streaming/src/test/java/org/apache/hadoop/streaming/TestUlimit.java
          Hide
          Hudson added a comment -

          Integrated in Hadoop-Mapreduce-0.23-Build #179 (See https://builds.apache.org/job/Hadoop-Mapreduce-0.23-Build/179/)
          Merge -c 1239391 from trunk to branch-0.23 to fix MAPREDUCE-3427. Fix streaming unit tests broken after mavenization.

          acmurthy : http://svn.apache.org/viewcvs.cgi/?root=Apache-SVN&view=rev&rev=1239392
          Files :

          • /hadoop/common/branches/branch-0.23/hadoop-mapreduce-project/CHANGES.txt
          • /hadoop/common/branches/branch-0.23/hadoop-tools/hadoop-streaming/pom.xml
          • /hadoop/common/branches/branch-0.23/hadoop-tools/hadoop-streaming/src/test/java/org/apache/hadoop/streaming/TestStreamingBadRecords.java
          • /hadoop/common/branches/branch-0.23/hadoop-tools/hadoop-streaming/src/test/java/org/apache/hadoop/streaming/TestUlimit.java
          Show
          Hudson added a comment - Integrated in Hadoop-Mapreduce-0.23-Build #179 (See https://builds.apache.org/job/Hadoop-Mapreduce-0.23-Build/179/ ) Merge -c 1239391 from trunk to branch-0.23 to fix MAPREDUCE-3427 . Fix streaming unit tests broken after mavenization. acmurthy : http://svn.apache.org/viewcvs.cgi/?root=Apache-SVN&view=rev&rev=1239392 Files : /hadoop/common/branches/branch-0.23/hadoop-mapreduce-project/CHANGES.txt /hadoop/common/branches/branch-0.23/hadoop-tools/hadoop-streaming/pom.xml /hadoop/common/branches/branch-0.23/hadoop-tools/hadoop-streaming/src/test/java/org/apache/hadoop/streaming/TestStreamingBadRecords.java /hadoop/common/branches/branch-0.23/hadoop-tools/hadoop-streaming/src/test/java/org/apache/hadoop/streaming/TestUlimit.java
          Hide
          Hudson added a comment -

          Integrated in Hadoop-Mapreduce-trunk #977 (See https://builds.apache.org/job/Hadoop-Mapreduce-trunk/977/)
          MAPREDUCE-3427. Fix streaming unit tests broken after mavenization. Contributed by Hitesh Shah.

          acmurthy : http://svn.apache.org/viewcvs.cgi/?root=Apache-SVN&view=rev&rev=1239391
          Files :

          • /hadoop/common/trunk/hadoop-mapreduce-project/CHANGES.txt
          • /hadoop/common/trunk/hadoop-tools/hadoop-streaming/pom.xml
          • /hadoop/common/trunk/hadoop-tools/hadoop-streaming/src/test/java/org/apache/hadoop/streaming/TestStreamingBadRecords.java
          • /hadoop/common/trunk/hadoop-tools/hadoop-streaming/src/test/java/org/apache/hadoop/streaming/TestUlimit.java
          Show
          Hudson added a comment - Integrated in Hadoop-Mapreduce-trunk #977 (See https://builds.apache.org/job/Hadoop-Mapreduce-trunk/977/ ) MAPREDUCE-3427 . Fix streaming unit tests broken after mavenization. Contributed by Hitesh Shah. acmurthy : http://svn.apache.org/viewcvs.cgi/?root=Apache-SVN&view=rev&rev=1239391 Files : /hadoop/common/trunk/hadoop-mapreduce-project/CHANGES.txt /hadoop/common/trunk/hadoop-tools/hadoop-streaming/pom.xml /hadoop/common/trunk/hadoop-tools/hadoop-streaming/src/test/java/org/apache/hadoop/streaming/TestStreamingBadRecords.java /hadoop/common/trunk/hadoop-tools/hadoop-streaming/src/test/java/org/apache/hadoop/streaming/TestUlimit.java

            People

            • Assignee:
              Hitesh Shah
              Reporter:
              Alejandro Abdelnur
            • Votes:
              0 Vote for this issue
              Watchers:
              4 Start watching this issue

              Dates

              • Created:
                Updated:
                Resolved:

                Development