Uploaded image for project: 'Mahout'
  1. Mahout
  2. MAHOUT-1651

[JDK8] maven test failed for Mahout 0.9 with JDK 8, and JDK 7 can pass

    XMLWordPrintableJSON

    Details

    • Type: Bug
    • Status: Closed
    • Priority: Minor
    • Resolution: Not A Problem
    • Affects Version/s: 0.9
    • Fix Version/s: 0.10.0
    • Component/s: Math
    • Labels:
      None

      Description

      Running org.apache.mahout.math.random.MultinomialTest
      Tests run: 8, Failures: 1, Errors: 0, Skipped: 0, Time elapsed: 0.371 sec <<< FAILURE! - in org.apache.mahout.math.random.MultinomialTest
      testPrime(org.apache.mahout.math.random.MultinomialTest) Time elapsed: 0.039 sec <<< FAILURE!
      java.lang.AssertionError: expected:<16> but was:<17>
      at __randomizedtesting.SeedInfo.seed([AAD9BA068467B3DA:9D6D3992EDADE21A]:0)
      at org.junit.Assert.fail(Assert.java:88)
      at org.junit.Assert.failNotEquals(Assert.java:743)
      at org.junit.Assert.assertEquals(Assert.java:118)
      at org.junit.Assert.assertEquals(Assert.java:555)
      at org.junit.Assert.assertEquals(Assert.java:542)
      at org.apache.mahout.math.random.MultinomialTest.testPrime(MultinomialTest.java:143)

        Attachments

          Activity

            People

            • Assignee:
              smarthi Suneel Marthi
              Reporter:
              zb161 zhubin
            • Votes:
              0 Vote for this issue
              Watchers:
              3 Start watching this issue

              Dates

              • Created:
                Updated:
                Resolved: