Uploaded image for project: 'Log4j 2'
  1. Log4j 2
  2. LOG4J2-3446

AGPBI: {"kind":"error","text":"MethodHandle.invoke and MethodHandle.invokeExact are only supported starting with Android O (--min-api 26)","sources":[{}],"tool":"D8"}

    XMLWordPrintableJSON

Details

    • Bug
    • Status: Open
    • Critical
    • Resolution: Unresolved
    • 2.17.2
    • None
    • Build
    • None

    Description

      Adding org.apache.logging.log4j:log4j-core:2.17.2 to an Android project ,but when I install app on device by androidstudio, the error come out.(MethodHandle.invoke and MethodHandle.invokeExact are only supported starting with Android O (--min-api 26)
      ). Could you help me?

      com.android.builder.dexing.DexArchiveBuilderException: com.android.builder.dexing.DexArchiveBuilderException: Failed to process C:\Users\leiyao7\.gradle\caches\modules-2\files-2.1\org.apache.logging.log4j\log4j-core\2.17.2\fa43ba4467f5300b16d1e0742934149bfc5ac564\log4j-core-2.17.2.jar
          at sun.reflect.NativeConstructorAccessorImpl.newInstance0(Native Method)
          at sun.reflect.NativeConstructorAccessorImpl.newInstance(NativeConstructorAccessorImpl.java:62)
          at sun.reflect.DelegatingConstructorAccessorImpl.newInstance(DelegatingConstructorAccessorImpl.java:45)
          at java.lang.reflect.Constructor.newInstance(Constructor.java:423)
          at java.util.concurrent.ForkJoinTask.getThrowableException(ForkJoinTask.java:593)
          at java.util.concurrent.ForkJoinTask.reportException(ForkJoinTask.java:677)
          at java.util.concurrent.ForkJoinTask.join(ForkJoinTask.java:720)
          at com.android.ide.common.internal.WaitableExecutor.waitForTasksWithQuickFail(WaitableExecutor.java:149)
          at com.android.build.gradle.internal.transforms.DexArchiveBuilderTransform.transform(DexArchiveBuilderTransform.java:420)
          at com.android.build.gradle.internal.pipeline.TransformTask$2.call(TransformTask.java:239)
          at com.android.build.gradle.internal.pipeline.TransformTask$2.call(TransformTask.java:235)
          at com.android.builder.profile.ThreadRecorder.record(ThreadRecorder.java:102)
          at com.android.build.gradle.internal.pipeline.TransformTask.transform(TransformTask.java:230)
          at sun.reflect.NativeMethodAccessorImpl.invoke0(Native Method)
          at sun.reflect.NativeMethodAccessorImpl.invoke(NativeMethodAccessorImpl.java:62)
          at sun.reflect.DelegatingMethodAccessorImpl.invoke(DelegatingMethodAccessorImpl.java:43)
          at java.lang.reflect.Method.invoke(Method.java:498)
          at org.gradle.internal.reflect.JavaMethod.invoke(JavaMethod.java:104)
          at org.gradle.api.internal.project.taskfactory.IncrementalTaskInputsTaskAction.doExecute(IncrementalTaskInputsTaskAction.java:47)
          at org.gradle.api.internal.project.taskfactory.StandardTaskAction.execute(StandardTaskAction.java:42)
          at org.gradle.api.internal.project.taskfactory.AbstractIncrementalTaskAction.execute(AbstractIncrementalTaskAction.java:25)
          at org.gradle.api.internal.project.taskfactory.StandardTaskAction.execute(StandardTaskAction.java:28)
          at org.gradle.api.internal.tasks.execution.ExecuteActionsTaskExecuter$3.run(ExecuteActionsTaskExecuter.java:568)
          at org.gradle.internal.operations.DefaultBuildOperationExecutor$RunnableBuildOperationWorker.execute(DefaultBuildOperationExecutor.java:402)
          at org.gradle.internal.operations.DefaultBuildOperationExecutor$RunnableBuildOperationWorker.execute(DefaultBuildOperationExecutor.java:394)
          at org.gradle.internal.operations.DefaultBuildOperationExecutor$1.execute(DefaultBuildOperationExecutor.java:165)
          at org.gradle.internal.operations.DefaultBuildOperationExecutor.execute(DefaultBuildOperationExecutor.java:250)
          at org.gradle.internal.operations.DefaultBuildOperationExecutor.execute(DefaultBuildOperationExecutor.java:158)
          at org.gradle.internal.operations.DefaultBuildOperationExecutor.run(DefaultBuildOperationExecutor.java:92)
          at org.gradle.internal.operations.DelegatingBuildOperationExecutor.run(DelegatingBuildOperationExecutor.java:31)
          at org.gradle.api.internal.tasks.execution.ExecuteActionsTaskExecuter.executeAction(ExecuteActionsTaskExecuter.java:553)
          at org.gradle.api.internal.tasks.execution.ExecuteActionsTaskExecuter.executeActions(ExecuteActionsTaskExecuter.java:536)
          at org.gradle.api.internal.tasks.execution.ExecuteActionsTaskExecuter.access$300(ExecuteActionsTaskExecuter.java:109)
          at org.gradle.api.internal.tasks.execution.ExecuteActionsTaskExecuter$TaskExecution.executeWithPreviousOutputFiles(ExecuteActionsTaskExecuter.java:276)
          at org.gradle.api.internal.tasks.execution.ExecuteActionsTaskExecuter$TaskExecution.execute(ExecuteActionsTaskExecuter.java:265)
          at org.gradle.internal.execution.steps.ExecuteStep.lambda$execute$0(ExecuteStep.java:32)
          at java.util.Optional.map(Optional.java:215)
          at org.gradle.internal.execution.steps.ExecuteStep.execute(ExecuteStep.java:32)
          at org.gradle.internal.execution.steps.ExecuteStep.execute(ExecuteStep.java:26)
          at org.gradle.internal.execution.steps.CleanupOutputsStep.execute(CleanupOutputsStep.java:63)
          at org.gradle.internal.execution.steps.CleanupOutputsStep.execute(CleanupOutputsStep.java:35)
          at org.gradle.internal.execution.steps.ResolveInputChangesStep.execute(ResolveInputChangesStep.java:49)
          at org.gradle.internal.execution.steps.ResolveInputChangesStep.execute(ResolveInputChangesStep.java:34)
          at org.gradle.internal.execution.steps.CancelExecutionStep.execute(CancelExecutionStep.java:43)
          at org.gradle.internal.execution.steps.TimeoutStep.executeWithoutTimeout(TimeoutStep.java:73)
          at org.gradle.internal.execution.steps.TimeoutStep.execute(TimeoutStep.java:54)
          at org.gradle.internal.execution.steps.CatchExceptionStep.execute(CatchExceptionStep.java:34)
          at org.gradle.internal.execution.steps.CreateOutputsStep.execute(CreateOutputsStep.java:44)
          at org.gradle.internal.execution.steps.SnapshotOutputsStep.execute(SnapshotOutputsStep.java:54)
          at org.gradle.internal.execution.steps.SnapshotOutputsStep.execute(SnapshotOutputsStep.java:38)
          at org.gradle.internal.execution.steps.BroadcastChangingOutputsStep.execute(BroadcastChangingOutputsStep.java:49)
          at org.gradle.internal.execution.steps.CacheStep.executeWithoutCache(CacheStep.java:153)
          at org.gradle.internal.execution.steps.CacheStep.execute(CacheStep.java:67)
          at org.gradle.internal.execution.steps.CacheStep.execute(CacheStep.java:41)
          at org.gradle.internal.execution.steps.StoreExecutionStateStep.execute(StoreExecutionStateStep.java:44)
          at org.gradle.internal.execution.steps.StoreExecutionStateStep.execute(StoreExecutionStateStep.java:33)
          at org.gradle.internal.execution.steps.RecordOutputsStep.execute(RecordOutputsStep.java:38)
          at org.gradle.internal.execution.steps.RecordOutputsStep.execute(RecordOutputsStep.java:24)
          at org.gradle.internal.execution.steps.SkipUpToDateStep.executeBecause(SkipUpToDateStep.java:92)
          at org.gradle.internal.execution.steps.SkipUpToDateStep.lambda$execute$0(SkipUpToDateStep.java:85)
          at java.util.Optional.map(Optional.java:215)
          at org.gradle.internal.execution.steps.SkipUpToDateStep.execute(SkipUpToDateStep.java:55)
          at org.gradle.internal.execution.steps.SkipUpToDateStep.execute(SkipUpToDateStep.java:39)
          at org.gradle.internal.execution.steps.ResolveChangesStep.execute(ResolveChangesStep.java:76)
          at org.gradle.internal.execution.steps.ResolveChangesStep.execute(ResolveChangesStep.java:37)
          at org.gradle.internal.execution.steps.legacy.MarkSnapshottingInputsFinishedStep.execute(MarkSnapshottingInputsFinishedStep.java:36)
          at org.gradle.internal.execution.steps.legacy.MarkSnapshottingInputsFinishedStep.execute(MarkSnapshottingInputsFinishedStep.java:26)
          at org.gradle.internal.execution.steps.ResolveCachingStateStep.execute(ResolveCachingStateStep.java:94)
          at org.gradle.internal.execution.steps.ResolveCachingStateStep.execute(ResolveCachingStateStep.java:49)
          at org.gradle.internal.execution.steps.CaptureStateBeforeExecutionStep.execute(CaptureStateBeforeExecutionStep.java:79)
          at org.gradle.internal.execution.steps.CaptureStateBeforeExecutionStep.execute(CaptureStateBeforeExecutionStep.java:53)
          at org.gradle.internal.execution.steps.ValidateStep.execute(ValidateStep.java:74)
          at org.gradle.internal.execution.steps.SkipEmptyWorkStep.lambda$execute$2(SkipEmptyWorkStep.java:78)
          at java.util.Optional.orElseGet(Optional.java:267)
          at org.gradle.internal.execution.steps.SkipEmptyWorkStep.execute(SkipEmptyWorkStep.java:78)
          at org.gradle.internal.execution.steps.SkipEmptyWorkStep.execute(SkipEmptyWorkStep.java:34)
          at org.gradle.internal.execution.steps.legacy.MarkSnapshottingInputsStartedStep.execute(MarkSnapshottingInputsStartedStep.java:39)
          at org.gradle.internal.execution.steps.LoadExecutionStateStep.execute(LoadExecutionStateStep.java:40)
          at org.gradle.internal.execution.steps.LoadExecutionStateStep.execute(LoadExecutionStateStep.java:28)
          at org.gradle.internal.execution.impl.DefaultWorkExecutor.execute(DefaultWorkExecutor.java:33)
          at org.gradle.api.internal.tasks.execution.ExecuteActionsTaskExecuter.executeIfValid(ExecuteActionsTaskExecuter.java:192)
          at org.gradle.api.internal.tasks.execution.ExecuteActionsTaskExecuter.execute(ExecuteActionsTaskExecuter.java:184)
          at org.gradle.api.internal.tasks.execution.CleanupStaleOutputsExecuter.execute(CleanupStaleOutputsExecuter.java:109)
          at org.gradle.api.internal.tasks.execution.FinalizePropertiesTaskExecuter.execute(FinalizePropertiesTaskExecuter.java:46)
          at org.gradle.api.internal.tasks.execution.ResolveTaskExecutionModeExecuter.execute(ResolveTaskExecutionModeExecuter.java:62)
          at org.gradle.api.internal.tasks.execution.SkipTaskWithNoActionsExecuter.execute(SkipTaskWithNoActionsExecuter.java:57)
          at org.gradle.api.internal.tasks.execution.SkipOnlyIfTaskExecuter.execute(SkipOnlyIfTaskExecuter.java:56)
          at org.gradle.api.internal.tasks.execution.CatchExceptionTaskExecuter.execute(CatchExceptionTaskExecuter.java:36)
          at org.gradle.api.internal.tasks.execution.EventFiringTaskExecuter$1.executeTask(EventFiringTaskExecuter.java:77)
          at org.gradle.api.internal.tasks.execution.EventFiringTaskExecuter$1.call(EventFiringTaskExecuter.java:55)
          at org.gradle.api.internal.tasks.execution.EventFiringTaskExecuter$1.call(EventFiringTaskExecuter.java:52)
          at org.gradle.internal.operations.DefaultBuildOperationExecutor$CallableBuildOperationWorker.execute(DefaultBuildOperationExecutor.java:416)
          at org.gradle.internal.operations.DefaultBuildOperationExecutor$CallableBuildOperationWorker.execute(DefaultBuildOperationExecutor.java:406)
          at org.gradle.internal.operations.DefaultBuildOperationExecutor$1.execute(DefaultBuildOperationExecutor.java:165)
          at org.gradle.internal.operations.DefaultBuildOperationExecutor.execute(DefaultBuildOperationExecutor.java:250)
          at org.gradle.internal.operations.DefaultBuildOperationExecutor.execute(DefaultBuildOperationExecutor.java:158)
          at org.gradle.internal.operations.DefaultBuildOperationExecutor.call(DefaultBuildOperationExecutor.java:102)
          at org.gradle.internal.operations.DelegatingBuildOperationExecutor.call(DelegatingBuildOperationExecutor.java:36)
          at org.gradle.api.internal.tasks.execution.EventFiringTaskExecuter.execute(EventFiringTaskExecuter.java:52)
          at org.gradle.execution.plan.LocalTaskNodeExecutor.execute(LocalTaskNodeExecutor.java:41)
          at org.gradle.execution.taskgraph.DefaultTaskExecutionGraph$InvokeNodeExecutorsAction.execute(DefaultTaskExecutionGraph.java:372)
          at org.gradle.execution.taskgraph.DefaultTaskExecutionGraph$InvokeNodeExecutorsAction.execute(DefaultTaskExecutionGraph.java:359)
          at org.gradle.execution.taskgraph.DefaultTaskExecutionGraph$BuildOperationAwareExecutionAction.execute(DefaultTaskExecutionGraph.java:352)
          at org.gradle.execution.taskgraph.DefaultTaskExecutionGraph$BuildOperationAwareExecutionAction.execute(DefaultTaskExecutionGraph.java:338)
          at org.gradle.execution.plan.DefaultPlanExecutor$ExecutorWorker.lambda$run$0(DefaultPlanExecutor.java:127)
          at org.gradle.execution.plan.DefaultPlanExecutor$ExecutorWorker.execute(DefaultPlanExecutor.java:191)
          at org.gradle.execution.plan.DefaultPlanExecutor$ExecutorWorker.executeNextNode(DefaultPlanExecutor.java:182)
          at org.gradle.execution.plan.DefaultPlanExecutor$ExecutorWorker.run(DefaultPlanExecutor.java:124)
          at org.gradle.internal.concurrent.ExecutorPolicy$CatchAndRecordFailures.onExecute(ExecutorPolicy.java:64)
          at org.gradle.internal.concurrent.ManagedExecutorImpl$1.run(ManagedExecutorImpl.java:48)
          at java.util.concurrent.ThreadPoolExecutor.runWorker(ThreadPoolExecutor.java:1149)
          at java.util.concurrent.ThreadPoolExecutor$Worker.run(ThreadPoolExecutor.java:624)
          at org.gradle.internal.concurrent.ThreadFactoryImpl$ManagedThreadRunnable.run(ThreadFactoryImpl.java:56)
          at java.lang.Thread.run(Thread.java:748)
      Caused by: com.android.builder.dexing.DexArchiveBuilderException: Failed to process C:\Users\leiyao7\.gradle\caches\modules-2\files-2.1\org.apache.logging.log4j\log4j-core\2.17.2\fa43ba4467f5300b16d1e0742934149bfc5ac564\log4j-core-2.17.2.jar
          at com.android.build.gradle.internal.transforms.DexArchiveBuilderTransform.launchProcessing(DexArchiveBuilderTransform.java:909)
          at com.android.build.gradle.internal.transforms.DexArchiveBuilderTransform.lambda$convertToDexArchive$6(DexArchiveBuilderTransform.java:834)
          at java.util.concurrent.ForkJoinTask$AdaptedCallable.exec(ForkJoinTask.java:1424)
          at java.util.concurrent.ForkJoinTask.doExec(ForkJoinTask.java:289)
          at java.util.concurrent.ForkJoinPool$WorkQueue.runTask(ForkJoinPool.java:1067)
          at java.util.concurrent.ForkJoinPool.runWorker(ForkJoinPool.java:1703)
          at java.util.concurrent.ForkJoinWorkerThread.run(ForkJoinWorkerThread.java:172)
      Caused by: com.android.builder.dexing.DexArchiveBuilderException: Error while dexing.
          at com.android.builder.dexing.D8DexArchiveBuilder.getExceptionToRethrow(D8DexArchiveBuilder.java:124)
          at com.android.builder.dexing.D8DexArchiveBuilder.convert(D8DexArchiveBuilder.java:101)
          at com.android.build.gradle.internal.transforms.DexArchiveBuilderTransform.launchProcessing(DexArchiveBuilderTransform.java:904)
          ... 6 more
      Caused by: com.android.tools.r8.CompilationFailedException: Compilation failed to complete
          at com.android.tools.r8.utils.ExceptionUtils.withCompilationHandler(ExceptionUtils.java:81)
          at com.android.tools.r8.utils.ExceptionUtils.withD8CompilationHandler(ExceptionUtils.java:45)
          at com.android.tools.r8.D8.run(D8.java:94)
          at com.android.builder.dexing.D8DexArchiveBuilder.convert(D8DexArchiveBuilder.java:99)
          ... 7 more
      Caused by: com.android.tools.r8.utils.AbortException: Error: MethodHandle.invoke and MethodHandle.invokeExact are only supported starting with Android O (--min-api 26)
          at com.android.tools.r8.utils.Reporter.failIfPendingErrors(Reporter.java:101)
          at com.android.tools.r8.utils.Reporter.fatalError(Reporter.java:72)
          at com.android.tools.r8.utils.ExceptionUtils.withCompilationHandler(ExceptionUtils.java:66)
          ... 10 more

       

      Attachments

        Activity

          People

            Unassigned Unassigned
            leiyao leiyao
            Votes:
            0 Vote for this issue
            Watchers:
            3 Start watching this issue

            Dates

              Created:
              Updated: