Uploaded image for project: 'Kafka'
  1. Kafka
  2. KAFKA-8394

Cannot Start a build with New Gradle Version

    XMLWordPrintableJSON

    Details

    • Type: Bug
    • Status: Open
    • Priority: Major
    • Resolution: Unresolved
    • Affects Version/s: 2.2.0
    • Fix Version/s: None
    • Component/s: build
    • Labels:
      None

      Description

      When I downloaded gradle 5.4.1 and ran `gradle wrapper` - the build failed because the scoverage plugin dependency encountered some build errors. The following is the output

       

      org.gradle.api.GradleScriptException: A problem occurred evaluating root
      project 'kafka'.
              at
      org.gradle.groovy.scripts.internal.DefaultScriptRunnerFactory$ScriptRunnerImpl.run(DefaultScriptRunnerFactory.java:92)
              at
      org.gradle.configuration.DefaultScriptPluginFactory$ScriptPluginImpl$2.run(DefaultScriptPluginFactory.java:221)
              at
      org.gradle.configuration.ProjectScriptTarget.addConfiguration(ProjectScriptTarget.java:77)
              at
      org.gradle.configuration.DefaultScriptPluginFactory$ScriptPluginImpl.apply(DefaultScriptPluginFactory.java:226)
              at
      org.gradle.configuration.BuildOperationScriptPlugin$1$1.run(BuildOperationScriptPlugin.java:69)
              at
      org.gradle.internal.operations.DefaultBuildOperationExecutor$RunnableBuildOperationWorker.execute(DefaultBuildOperationExecutor.java:402)
              at
      org.gradle.internal.operations.DefaultBuildOperationExecutor$RunnableBuildOperationWorker.execute(DefaultBuildOperationExecutor.java:394)
              at
      org.gradle.internal.operations.DefaultBuildOperationExecutor$1.execute(DefaultBuildOperationExecutor.java:165)
              at
      org.gradle.internal.operations.DefaultBuildOperationExecutor.execute(DefaultBuildOperationExecutor.java:250)
              at
      org.gradle.internal.operations.DefaultBuildOperationExecutor.execute(DefaultBuildOperationExecutor.java:158)
              at
      org.gradle.internal.operations.DefaultBuildOperationExecutor.run(DefaultBuildOperationExecutor.java:92)
              at
      org.gradle.internal.operations.DelegatingBuildOperationExecutor.run(DelegatingBuildOperationExecutor.java:31)
              at
      org.gradle.configuration.BuildOperationScriptPlugin$1.execute(BuildOperationScriptPlugin.java:66)
              at
      org.gradle.configuration.BuildOperationScriptPlugin$1.execute(BuildOperationScriptPlugin.java:63)
              at
      org.gradle.configuration.internal.DefaultUserCodeApplicationContext.apply(DefaultUserCodeApplicationContext.java:48)
              at
      org.gradle.configuration.BuildOperationScriptPlugin.apply(BuildOperationScriptPlugin.java:63)
              at
      org.gradle.configuration.project.BuildScriptProcessor$1.run(BuildScriptProcessor.java:44)
              at org.gradle.internal.Factories$1.create(Factories.java:25)
              at
      org.gradle.api.internal.project.DefaultProjectStateRegistry$ProjectStateImpl.withMutableState(DefaultProjectStateRegistry.java:200)
              at
      org.gradle.api.internal.project.DefaultProjectStateRegistry$ProjectStateImpl.withMutableState(DefaultProjectStateRegistry.java:186)
              at
      org.gradle.configuration.project.BuildScriptProcessor.execute(BuildScriptProcessor.java:41)
              at
      org.gradle.configuration.project.BuildScriptProcessor.execute(BuildScriptProcessor.java:26)
              at
      org.gradle.configuration.project.ConfigureActionsProjectEvaluator.evaluate(ConfigureActionsProjectEvaluator.java:34)
              at
      org.gradle.configuration.project.LifecycleProjectEvaluator$EvaluateProject$1.run(LifecycleProjectEvaluator.java:106)
              at org.gradle.internal.Factories$1.create(Factories.java:25)
              at
      org.gradle.internal.work.DefaultWorkerLeaseService.withLocks(DefaultWorkerLeaseService.java:183)
              at
      org.gradle.internal.work.StopShieldingWorkerLeaseService.withLocks(StopShieldingWorkerLeaseService.java:40)
              at
      org.gradle.api.internal.project.DefaultProjectStateRegistry$ProjectStateImpl.withProjectLock(DefaultProjectStateRegistry.java:226)
              at
      org.gradle.api.internal.project.DefaultProjectStateRegistry$ProjectStateImpl.withMutableState(DefaultProjectStateRegistry.java:220)
              at
      org.gradle.api.internal.project.DefaultProjectStateRegistry$ProjectStateImpl.withMutableState(DefaultProjectStateRegistry.java:186)
              at
      org.gradle.configuration.project.LifecycleProjectEvaluator$EvaluateProject.run(LifecycleProjectEvaluator.java:95)
              at
      org.gradle.internal.operations.DefaultBuildOperationExecutor$RunnableBuildOperationWorker.execute(DefaultBuildOperationExecutor.java:402)
              at
      org.gradle.internal.operations.DefaultBuildOperationExecutor$RunnableBuildOperationWorker.execute(DefaultBuildOperationExecutor.java:394)
              at
      org.gradle.internal.operations.DefaultBuildOperationExecutor$1.execute(DefaultBuildOperationExecutor.java:165)
              at
      org.gradle.internal.operations.DefaultBuildOperationExecutor.execute(DefaultBuildOperationExecutor.java:250)
              at
      org.gradle.internal.operations.DefaultBuildOperationExecutor.execute(DefaultBuildOperationExecutor.java:158)
              at
      org.gradle.internal.operations.DefaultBuildOperationExecutor.run(DefaultBuildOperationExecutor.java:92)
              at
      org.gradle.internal.operations.DelegatingBuildOperationExecutor.run(DelegatingBuildOperationExecutor.java:31)
              at
      org.gradle.configuration.project.LifecycleProjectEvaluator.evaluate(LifecycleProjectEvaluator.java:67)
              at
      org.gradle.api.internal.project.DefaultProject.evaluate(DefaultProject.java:695)
              at
      org.gradle.api.internal.project.DefaultProject.evaluate(DefaultProject.java:143)
              at
      org.gradle.execution.TaskPathProjectEvaluator.configure(TaskPathProjectEvaluator.java:35)
              at
      org.gradle.execution.TaskPathProjectEvaluator.configureHierarchy(TaskPathProjectEvaluator.java:60)
              at
      org.gradle.configuration.DefaultBuildConfigurer.configure(DefaultBuildConfigurer.java:41)
              at
      org.gradle.initialization.DefaultGradleLauncher$ConfigureBuild.run(DefaultGradleLauncher.java:302)
              at
      org.gradle.internal.operations.DefaultBuildOperationExecutor$RunnableBuildOperationWorker.execute(DefaultBuildOperationExecutor.java:402)
              at
      org.gradle.internal.operations.DefaultBuildOperationExecutor$RunnableBuildOperationWorker.execute(DefaultBuildOperationExecutor.java:394)
              at
      org.gradle.internal.operations.DefaultBuildOperationExecutor$1.execute(DefaultBuildOperationExecutor.java:165)
              at
      org.gradle.internal.operations.DefaultBuildOperationExecutor.execute(DefaultBuildOperationExecutor.java:250)
              at
      org.gradle.internal.operations.DefaultBuildOperationExecutor.execute(DefaultBuildOperationExecutor.java:158)
              at
      org.gradle.internal.operations.DefaultBuildOperationExecutor.run(DefaultBuildOperationExecutor.java:92)
              at
      org.gradle.internal.operations.DelegatingBuildOperationExecutor.run(DelegatingBuildOperationExecutor.java:31)
              at
      org.gradle.initialization.DefaultGradleLauncher.configureBuild(DefaultGradleLauncher.java:210)
              at
      org.gradle.initialization.DefaultGradleLauncher.doBuildStages(DefaultGradleLauncher.java:151)
              at
      org.gradle.initialization.DefaultGradleLauncher.executeTasks(DefaultGradleLauncher.java:134)
              at
      org.gradle.internal.invocation.GradleBuildController$1.execute(GradleBuildController.java:58)
              at
      org.gradle.internal.invocation.GradleBuildController$1.execute(GradleBuildController.java:55)
              at
      org.gradle.internal.invocation.GradleBuildController$3.create(GradleBuildController.java:82)
              at
      org.gradle.internal.invocation.GradleBuildController$3.create(GradleBuildController.java:75)
              at
      org.gradle.internal.work.DefaultWorkerLeaseService.withLocks(DefaultWorkerLeaseService.java:183)
              at
      org.gradle.internal.work.StopShieldingWorkerLeaseService.withLocks(StopShieldingWorkerLeaseService.java:40)
              at
      org.gradle.internal.invocation.GradleBuildController.doBuild(GradleBuildController.java:75)
              at
      org.gradle.internal.invocation.GradleBuildController.run(GradleBuildController.java:55)
              at
      org.gradle.tooling.internal.provider.ExecuteBuildActionRunner.run(ExecuteBuildActionRunner.java:31)
              at
      org.gradle.launcher.exec.ChainingBuildActionRunner.run(ChainingBuildActionRunner.java:35)
              at
      org.gradle.launcher.exec.BuildOutcomeReportingBuildActionRunner.run(BuildOutcomeReportingBuildActionRunner.java:58)
              at
      org.gradle.tooling.internal.provider.ValidatingBuildActionRunner.run(ValidatingBuildActionRunner.java:32)
              at
      org.gradle.launcher.exec.BuildCompletionNotifyingBuildActionRunner.run(BuildCompletionNotifyingBuildActionRunner.java:39)
              at
      org.gradle.launcher.exec.RunAsBuildOperationBuildActionRunner$3.call(RunAsBuildOperationBuildActionRunner.java:51)
              at
      org.gradle.launcher.exec.RunAsBuildOperationBuildActionRunner$3.call(RunAsBuildOperationBuildActionRunner.java:45)
              at
      org.gradle.internal.operations.DefaultBuildOperationExecutor$CallableBuildOperationWorker.execute(DefaultBuildOperationExecutor.java:416)
              at
      org.gradle.internal.operations.DefaultBuildOperationExecutor$CallableBuildOperationWorker.execute(DefaultBuildOperationExecutor.java:406)
              at
      org.gradle.internal.operations.DefaultBuildOperationExecutor$1.execute(DefaultBuildOperationExecutor.java:165)
              at
      org.gradle.internal.operations.DefaultBuildOperationExecutor.execute(DefaultBuildOperationExecutor.java:250)
              at
      org.gradle.internal.operations.DefaultBuildOperationExecutor.execute(DefaultBuildOperationExecutor.java:158)
              at
      org.gradle.internal.operations.DefaultBuildOperationExecutor.call(DefaultBuildOperationExecutor.java:102)
              at
      org.gradle.internal.operations.DelegatingBuildOperationExecutor.call(DelegatingBuildOperationExecutor.java:36)
              at
      org.gradle.launcher.exec.RunAsBuildOperationBuildActionRunner.run(RunAsBuildOperationBuildActionRunner.java:45)
              at
      org.gradle.launcher.exec.InProcessBuildActionExecuter$1.transform(InProcessBuildActionExecuter.java:49)
              at
      org.gradle.launcher.exec.InProcessBuildActionExecuter$1.transform(InProcessBuildActionExecuter.java:46)
              at
      org.gradle.composite.internal.DefaultRootBuildState.run(DefaultRootBuildState.java:78)
              at
      org.gradle.launcher.exec.InProcessBuildActionExecuter.execute(InProcessBuildActionExecuter.java:46)
              at
      org.gradle.launcher.exec.InProcessBuildActionExecuter.execute(InProcessBuildActionExecuter.java:31)
              at
      org.gradle.launcher.exec.BuildTreeScopeBuildActionExecuter.execute(BuildTreeScopeBuildActionExecuter.java:42)
              at
      org.gradle.launcher.exec.BuildTreeScopeBuildActionExecuter.execute(BuildTreeScopeBuildActionExecuter.java:28)
              at
      org.gradle.tooling.internal.provider.ContinuousBuildActionExecuter.execute(ContinuousBuildActionExecuter.java:78)
              at
      org.gradle.tooling.internal.provider.ContinuousBuildActionExecuter.execute(ContinuousBuildActionExecuter.java:52)
              at
      org.gradle.tooling.internal.provider.SubscribableBuildActionExecuter.execute(SubscribableBuildActionExecuter.java:59)
              at
      org.gradle.tooling.internal.provider.SubscribableBuildActionExecuter.execute(SubscribableBuildActionExecuter.java:36)
              at
      org.gradle.tooling.internal.provider.SessionScopeBuildActionExecuter.execute(SessionScopeBuildActionExecuter.java:68)
              at
      org.gradle.tooling.internal.provider.SessionScopeBuildActionExecuter.execute(SessionScopeBuildActionExecuter.java:38)
              at
      org.gradle.tooling.internal.provider.GradleThreadBuildActionExecuter.execute(GradleThreadBuildActionExecuter.java:37)
              at
      org.gradle.tooling.internal.provider.GradleThreadBuildActionExecuter.execute(GradleThreadBuildActionExecuter.java:26)
              at
      org.gradle.tooling.internal.provider.ParallelismConfigurationBuildActionExecuter.execute(ParallelismConfigurationBuildActionExecuter.java:43)
              at
      org.gradle.tooling.internal.provider.ParallelismConfigurationBuildActionExecuter.execute(ParallelismConfigurationBuildActionExecuter.java:29)
              at
      org.gradle.tooling.internal.provider.StartParamsValidatingActionExecuter.execute(StartParamsValidatingActionExecuter.java:60)
              at
      org.gradle.tooling.internal.provider.StartParamsValidatingActionExecuter.execute(StartParamsValidatingActionExecuter.java:32)
              at
      org.gradle.tooling.internal.provider.SessionFailureReportingActionExecuter.execute(SessionFailureReportingActionExecuter.java:55)
              at
      org.gradle.tooling.internal.provider.SessionFailureReportingActionExecuter.execute(SessionFailureReportingActionExecuter.java:41)
              at
      org.gradle.tooling.internal.provider.SetupLoggingActionExecuter.execute(SetupLoggingActionExecuter.java:48)
              at
      org.gradle.tooling.internal.provider.SetupLoggingActionExecuter.execute(SetupLoggingActionExecuter.java:32)
              at
      org.gradle.launcher.daemon.server.exec.ExecuteBuild.doBuild(ExecuteBuild.java:67)
              at
      org.gradle.launcher.daemon.server.exec.BuildCommandOnly.execute(BuildCommandOnly.java:36)
              at
      org.gradle.launcher.daemon.server.api.DaemonCommandExecution.proceed(DaemonCommandExecution.java:104)
              at
      org.gradle.launcher.daemon.server.exec.WatchForDisconnection.execute(WatchForDisconnection.java:37)
              at
      org.gradle.launcher.daemon.server.api.DaemonCommandExecution.proceed(DaemonCommandExecution.java:104)
              at
      org.gradle.launcher.daemon.server.exec.ResetDeprecationLogger.execute(ResetDeprecationLogger.java:26)
              at
      org.gradle.launcher.daemon.server.api.DaemonCommandExecution.proceed(DaemonCommandExecution.java:104)
              at
      org.gradle.launcher.daemon.server.exec.RequestStopIfSingleUsedDaemon.execute(RequestStopIfSingleUsedDaemon.java:34)
              at
      org.gradle.launcher.daemon.server.api.DaemonCommandExecution.proceed(DaemonCommandExecution.java:104)
              at
      org.gradle.launcher.daemon.server.exec.ForwardClientInput$2.call(ForwardClientInput.java:74)
              at
      org.gradle.launcher.daemon.server.exec.ForwardClientInput$2.call(ForwardClientInput.java:72)
              at org.gradle.util.Swapper.swap(Swapper.java:38)
              at
      org.gradle.launcher.daemon.server.exec.ForwardClientInput.execute(ForwardClientInput.java:72)
              at
      org.gradle.launcher.daemon.server.api.DaemonCommandExecution.proceed(DaemonCommandExecution.java:104)
              at
      org.gradle.launcher.daemon.server.exec.LogAndCheckHealth.execute(LogAndCheckHealth.java:55)
              at
      org.gradle.launcher.daemon.server.api.DaemonCommandExecution.proceed(DaemonCommandExecution.java:104)
              at
      org.gradle.launcher.daemon.server.exec.LogToClient.doBuild(LogToClient.java:62)
              at
      org.gradle.launcher.daemon.server.exec.BuildCommandOnly.execute(BuildCommandOnly.java:36)
              at
      org.gradle.launcher.daemon.server.api.DaemonCommandExecution.proceed(DaemonCommandExecution.java:104)
              at
      org.gradle.launcher.daemon.server.exec.EstablishBuildEnvironment.doBuild(EstablishBuildEnvironment.java:81)
              at
      org.gradle.launcher.daemon.server.exec.BuildCommandOnly.execute(BuildCommandOnly.java:36)
              at
      org.gradle.launcher.daemon.server.api.DaemonCommandExecution.proceed(DaemonCommandExecution.java:104)
              at
      org.gradle.launcher.daemon.server.exec.StartBuildOrRespondWithBusy$1.run(StartBuildOrRespondWithBusy.java:50)
              at
      org.gradle.launcher.daemon.server.DaemonStateCoordinator$1.run(DaemonStateCoordinator.java:295)
              at
      org.gradle.internal.concurrent.ExecutorPolicy$CatchAndRecordFailures.onExecute(ExecutorPolicy.java:63)
              at
      org.gradle.internal.concurrent.ManagedExecutorImpl$1.run(ManagedExecutorImpl.java:46)
              at
      org.gradle.internal.concurrent.ThreadFactoryImpl$ManagedThreadRunnable.run(ThreadFactoryImpl.java:55)
      Caused by: org.gradle.api.internal.plugins.PluginApplicationException:
      Failed to apply plugin [id 'org.scoverage']
              at
      org.gradle.api.internal.plugins.DefaultPluginManager.doApply(DefaultPluginManager.java:163)
              at
      org.gradle.api.internal.plugins.DefaultPluginManager.apply(DefaultPluginManager.java:133)
              at
      org.gradle.api.internal.plugins.DefaultObjectConfigurationAction.applyType(DefaultObjectConfigurationAction.java:120)
              at
      org.gradle.api.internal.plugins.DefaultObjectConfigurationAction.access$200(DefaultObjectConfigurationAction.java:38)
              at
      org.gradle.api.internal.plugins.DefaultObjectConfigurationAction$3.run(DefaultObjectConfigurationAction.java:86)
              at
      org.gradle.api.internal.plugins.DefaultObjectConfigurationAction.execute(DefaultObjectConfigurationAction.java:143)
              at
      org.gradle.api.internal.project.AbstractPluginAware.apply(AbstractPluginAware.java:46)
              at
      org.gradle.internal.metaobject.BeanDynamicObject$MetaClassAdapter.invokeMethod(BeanDynamicObject.java:479)
              at
      org.gradle.internal.metaobject.BeanDynamicObject.tryInvokeMethod(BeanDynamicObject.java:191)
              at
      org.gradle.internal.metaobject.CompositeDynamicObject.tryInvokeMethod(CompositeDynamicObject.java:98)
              at
      org.gradle.internal.extensibility.MixInClosurePropertiesAsMethodsDynamicObject.tryInvokeMethod(MixInClosurePropertiesAsMethodsDynamicObject.java:33)
              at
      org.gradle.internal.metaobject.ConfigureDelegate.invokeMethod(ConfigureDelegate.java:56)
              at
      build_dflguj24ldvqqhe5tgnf25lvc$_run_closure31.doCall(C:\kafka\build.gradle:550)
              at
      org.gradle.util.ClosureBackedAction.execute(ClosureBackedAction.java:70)
              at
      org.gradle.util.ConfigureUtil.configureTarget(ConfigureUtil.java:154)
              at org.gradle.util.ConfigureUtil.configure(ConfigureUtil.java:105)
              at
      org.gradle.util.ConfigureUtil$WrappedConfigureAction.execute(ConfigureUtil.java:166)
              at
      org.gradle.api.internal.DefaultMutationGuard$2.execute(DefaultMutationGuard.java:41)
              at org.gradle.internal.Actions.with(Actions.java:246)
              at
      org.gradle.api.internal.project.BuildOperationCrossProjectConfigurator$2$1.run(BuildOperationCrossProjectConfigurator.java:79)
              at
      org.gradle.internal.operations.DefaultBuildOperationExecutor$RunnableBuildOperationWorker.execute(DefaultBuildOperationExecutor.java:402)
              at
      org.gradle.internal.operations.DefaultBuildOperationExecutor$RunnableBuildOperationWorker.execute(DefaultBuildOperationExecutor.java:394)
              at
      org.gradle.internal.operations.DefaultBuildOperationExecutor$1.execute(DefaultBuildOperationExecutor.java:165)
              at
      org.gradle.internal.operations.DefaultBuildOperationExecutor.execute(DefaultBuildOperationExecutor.java:250)
              at
      org.gradle.internal.operations.DefaultBuildOperationExecutor.execute(DefaultBuildOperationExecutor.java:158)
              at
      org.gradle.internal.operations.DefaultBuildOperationExecutor.run(DefaultBuildOperationExecutor.java:92)
              at
      org.gradle.internal.operations.DelegatingBuildOperationExecutor.run(DelegatingBuildOperationExecutor.java:31)
              at
      org.gradle.api.internal.project.BuildOperationCrossProjectConfigurator$2.run(BuildOperationCrossProjectConfigurator.java:76)
              at org.gradle.internal.Factories$1.create(Factories.java:25)
              at
      org.gradle.api.internal.project.DefaultProjectStateRegistry$ProjectStateImpl.withMutableState(DefaultProjectStateRegistry.java:200)
              at
      org.gradle.api.internal.project.DefaultProjectStateRegistry$ProjectStateImpl.withMutableState(DefaultProjectStateRegistry.java:186)
              at
      org.gradle.api.internal.project.BuildOperationCrossProjectConfigurator.runProjectConfigureAction(BuildOperationCrossProjectConfigurator.java:73)
              at
      org.gradle.api.internal.project.BuildOperationCrossProjectConfigurator.project(BuildOperationCrossProjectConfigurator.java:43)
              at
      org.gradle.api.internal.project.DefaultProject.project(DefaultProject.java:1157)
              at
      org.gradle.internal.metaobject.BeanDynamicObject$MetaClassAdapter.invokeMethod(BeanDynamicObject.java:479)
              at
      org.gradle.internal.metaobject.BeanDynamicObject.tryInvokeMethod(BeanDynamicObject.java:191)
              at
      org.gradle.internal.metaobject.CompositeDynamicObject.tryInvokeMethod(CompositeDynamicObject.java:98)
              at
      org.gradle.internal.extensibility.MixInClosurePropertiesAsMethodsDynamicObject.tryInvokeMethod(MixInClosurePropertiesAsMethodsDynamicObject.java:33)
              at
      org.gradle.groovy.scripts.BasicScript$ScriptDynamicObject.tryInvokeMethod(BasicScript.java:132)
              at
      org.gradle.internal.metaobject.AbstractDynamicObject.invokeMethod(AbstractDynamicObject.java:160)
              at
      org.gradle.groovy.scripts.BasicScript.invokeMethod(BasicScript.java:81)
              at build_dflguj24ldvqqhe5tgnf25lvc.run(C:\kafka\build.gradle:546)
              at
      org.gradle.groovy.scripts.internal.DefaultScriptRunnerFactory$ScriptRunnerImpl.run(DefaultScriptRunnerFactory.java:90)
              ... 127 more
      Caused by: org.gradle.api.reflect.ObjectInstantiationException: Could not
      create an instance of type org.scoverage.ScoverageExtension.
              at
      org.gradle.internal.instantiation.DependencyInjectingInstantiator.newInstance(DependencyInjectingInstantiator.java:53)
              at
      org.gradle.internal.extensibility.DefaultConvention.instantiate(DefaultConvention.java:224)
              at
      org.gradle.internal.extensibility.DefaultConvention.create(DefaultConvention.java:124)
              at org.scoverage.ScoveragePlugin.apply(ScoveragePlugin.groovy:18)
              at org.scoverage.ScoveragePlugin.apply(ScoveragePlugin.groovy)
              at
      org.gradle.api.internal.plugins.ImperativeOnlyPluginTarget.applyImperative(ImperativeOnlyPluginTarget.java:42)
              at
      org.gradle.api.internal.plugins.RuleBasedPluginTarget.applyImperative(RuleBasedPluginTarget.java:50)
              at
      org.gradle.api.internal.plugins.DefaultPluginManager.addPlugin(DefaultPluginManager.java:177)
              at
      org.gradle.api.internal.plugins.DefaultPluginManager.access$300(DefaultPluginManager.java:51)
              at
      org.gradle.api.internal.plugins.DefaultPluginManager$AddPluginBuildOperation.run(DefaultPluginManager.java:267)
              at
      org.gradle.internal.operations.DefaultBuildOperationExecutor$RunnableBuildOperationWorker.execute(DefaultBuildOperationExecutor.java:402)
              at
      org.gradle.internal.operations.DefaultBuildOperationExecutor$RunnableBuildOperationWorker.execute(DefaultBuildOperationExecutor.java:394)
              at
      org.gradle.internal.operations.DefaultBuildOperationExecutor$1.execute(DefaultBuildOperationExecutor.java:165)
              at
      org.gradle.internal.operations.DefaultBuildOperationExecutor.execute(DefaultBuildOperationExecutor.java:250)
              at
      org.gradle.internal.operations.DefaultBuildOperationExecutor.execute(DefaultBuildOperationExecutor.java:158)
              at
      org.gradle.internal.operations.DefaultBuildOperationExecutor.run(DefaultBuildOperationExecutor.java:92)
              at
      org.gradle.internal.operations.DelegatingBuildOperationExecutor.run(DelegatingBuildOperationExecutor.java:31)
              at
      org.gradle.api.internal.plugins.DefaultPluginManager$2.execute(DefaultPluginManager.java:155)
              at
      org.gradle.api.internal.plugins.DefaultPluginManager$2.execute(DefaultPluginManager.java:152)
              at
      org.gradle.configuration.internal.DefaultUserCodeApplicationContext.apply(DefaultUserCodeApplicationContext.java:48)
              at
      org.gradle.api.internal.plugins.DefaultPluginManager.doApply(DefaultPluginManager.java:152)
              ... 169 more
      Caused by: org.gradle.api.InvalidUserDataException: You can't map a
      property that does not exist: propertyName=testClassesDir
              at
      org.gradle.internal.extensibility.ConventionAwareHelper.map(ConventionAwareHelper.java:51)
              at
      org.gradle.internal.extensibility.ConventionAwareHelper.map(ConventionAwareHelper.java:75)
              at org.gradle.api.internal.ConventionMapping$map.call(Unknown
      Source)
              at
      org.scoverage.ScoverageExtension$_closure6.doCall(ScoverageExtension.groovy:89)
              at
      org.gradle.util.ClosureBackedAction.execute(ClosureBackedAction.java:70)
              at
      org.gradle.util.ConfigureUtil.configureTarget(ConfigureUtil.java:154)
              at
      org.gradle.util.ConfigureUtil.configureSelf(ConfigureUtil.java:130)
              at
      org.gradle.api.internal.AbstractTask.configure(AbstractTask.java:573)
              at
      org.gradle.api.internal.AbstractTask.configure(AbstractTask.java:91)
              at org.gradle.util.ConfigureUtil.configure(ConfigureUtil.java:103)
              at
      org.gradle.util.ConfigureUtil$WrappedConfigureAction.execute(ConfigureUtil.java:166)
              at
      org.gradle.api.internal.tasks.DefaultTaskContainer.create(DefaultTaskContainer.java:360)
              at
      org.gradle.api.internal.tasks.DefaultTaskContainer.create(DefaultTaskContainer.java:77)
              at
      org.gradle.api.internal.tasks.DefaultTaskContainer_Decorated.create(Unknown
      Source)
              at
      org.gradle.api.internal.tasks.DefaultTaskContainer_Decorated$create.call(Unknown
      Source)
              at
      org.scoverage.ScoverageExtension.<init>(ScoverageExtension.groovy:88)
              at org.scoverage.ScoverageExtension_Decorated.<init>(Unknown Source)
              at
      org.gradle.internal.instantiation.AsmBackedClassGenerator.newInstance(AsmBackedClassGenerator.java:153)
              at
      org.gradle.internal.instantiation.AbstractClassGenerator$GeneratedClassImpl$GeneratedConstructorImpl.newInstance(AbstractClassGenerator.java:363)
              at
      org.gradle.internal.instantiation.DependencyInjectingInstantiator.newInstance(DependencyInjectingInstantiator.java:48)
              ... 189 more

      The issue isn't reproducible when built with 4.0.1. Also, I don't see any clarification on Readme.md regarding this. I think the Gradle version compatibility should be checked (as a suggestion).

        Attachments

          Activity

            People

            • Assignee:
              Unassigned
              Reporter:
              manmedia@gmail.com M. Manna
            • Votes:
              0 Vote for this issue
              Watchers:
              1 Start watching this issue

              Dates

              • Due:
                Created:
                Updated:

                Time Tracking

                Estimated:
                Original Estimate - 48h
                48h
                Remaining:
                Remaining Estimate - 48h
                48h
                Logged:
                Time Spent - Not Specified
                Not Specified