Uploaded image for project: 'Kafka'
  1. Kafka
  2. KAFKA-2625

Unable to compile scala 2.10 with java 1.6

    XMLWordPrintableJSON

    Details

    • Type: Bug
    • Status: Resolved
    • Priority: Major
    • Resolution: Not A Problem
    • Affects Version/s: 0.9.0.0
    • Fix Version/s: None
    • Component/s: build
    • Labels:
      None
    • Environment:
      java version 1.6 javac version 1.6 gradle 2.7 scala 2.10.5 kafka 2.10-0.9.0.0

      Description

      when I issue ./gradlew releaseTarGz -x signArchives, I get the following,

      Building project 'core' with Scala version 2.10.5
      :clients:compileJava FAILED

      FAILURE: Build failed with an exception.

      • What went wrong:
        Execution failed for task ':clients:compileJava'.
        > invalid source release: 1.7
      • Try:
        Run with --stacktrace option to get the stack trace. Run with --info or --debug option to get more log output.

      BUILD FAILED

      I can provide more information if needed. Dint change any property file

        Attachments

          Activity

            People

            • Assignee:
              Unassigned
              Reporter:
              bv_arvind Arvind Viswanathan
            • Votes:
              0 Vote for this issue
              Watchers:
              2 Start watching this issue

              Dates

              • Created:
                Updated:
                Resolved: