Uploaded image for project: 'Kafka'
  1. Kafka
  2. KAFKA-1662

gradle release issue permgen space

    Details

    • Type: Bug
    • Status: Resolved
    • Priority: Blocker
    • Resolution: Fixed
    • Affects Version/s: None
    • Fix Version/s: 0.8.2.0
    • Component/s: None
    • Labels:

      Description

      Finding issues doing the kafka release with permgen space

      ./gradlew releaseTarGzAll

      ant:scaladoc] java.lang.OutOfMemoryError: PermGen space
      :kafka-0.8.2-ALPHA1-src:core:scaladoc FAILED
      :releaseTarGz_2_10_1 FAILED

      FAILURE: Build failed with an exception.

      • What went wrong:
        Execution failed for task ':core:scaladoc'.
        > PermGen space
      • Try:
        Run with --stacktrace option to get the stack trace. Run with --info or --debug option to get more log output.

      BUILD FAILED

      Total time: 5 mins 55.53 secs

      FAILURE: Build failed with an exception.

      • What went wrong:
        PermGen space

        Attachments

        1. KAFKA-1662.patch
          0.6 kB
          Sriharsha Chintalapani

          Activity

            People

            • Assignee:
              sriharsha Sriharsha Chintalapani
              Reporter:
              joestein Joe Stein
              Reviewer:
              Jun Rao
            • Votes:
              0 Vote for this issue
              Watchers:
              2 Start watching this issue

              Dates

              • Created:
                Updated:
                Resolved: