Uploaded image for project: 'jclouds'
  1. jclouds
  2. JCLOUDS-332

maven build fails on windows for the filesystem integration tests

    XMLWordPrintableJSON

    Details

    • Type: Bug
    • Status: Resolved
    • Priority: Major
    • Resolution: Fixed
    • Affects Version/s: None
    • Fix Version/s: 1.6.3
    • Component/s: jclouds-blobstore
    • Labels:
    • Environment:
      Windows

      Description

      https://gist.github.com/zack-shoylev/07876c6f3f685b14cc90

      maven clean install
      [...]
      Results :

      Failed tests: deleteObject(org.jclouds.filesystem.integration.FilesystemBlobIntegrationTest): java.io.IOException: Invalid argument
      deleteObject(org.jclouds.filesystem.integration.FilesystemBlobIntegrationTest): java.io.IOException: The filename, directory name, or volume label syntax is incorrect
      deleteObject(org.jclouds.filesystem.integration.FilesystemBlobIntegrationTest): java.io.IOException: Invalid argument
      deleteObject(org.jclouds.filesystem.integration.FilesystemBlobIntegrationTest): java.io.FileNotFoundException: .\target\basedir\zack-blobstore8\quote" (The filename, directory name, or volume label syntax is incorrect)
      deleteObject(org.jclouds.filesystem.integration.FilesystemBlobIntegrationTest): java.io.FileNotFoundException: .\target\basedir\zack-blobstore9{great<r} (The filename, directory name, or volume label syntax is incorrect)
      deleteObject(org.jclouds.filesystem.integration.FilesystemBlobIntegrationTest): java.io.FileNotFoundException: .\target\basedir\zack-blobstore0\lesst>en (The filename, directory name, or volume label syntax is incorrect)
      deleteObject(org.jclouds.filesystem.integration.FilesystemBlobIntegrationTest): java.io.IOException: The filename, directory name, or volume label syntax is incorrect
      containerExists(org.jclouds.filesystem.integration.FilesystemContainerIntegrationTest): java.io.IOException: Could not delete: .\target\basedir\zack-blobstore4\apples
      deleteContainerIfEmpty(org.jclouds.filesystem.integration.FilesystemContainerIntegrationTest): java.io.IOException: Could not delete: .\target\basedir\zack-blobstore5\apples
      deleteContainerWithContents(org.jclouds.filesystem.integration.FilesystemContainerIntegrationTest): java.io.IOException: Could not delete: .\target\basedir\zack-blobstore6\apples
      testListContainer(org.jclouds.filesystem.integration.FilesystemContainerIntegrationTest): java.io.IOException: Could not delete: .\target\basedir\zack-blobstore7\apples
      testListContainerMarker(org.jclouds.filesystem.integration.FilesystemContainerIntegrationTest): java.io.IOException: Could not delete: .\target\basedir\zack-blobstore8\hello
      (..)stListContainerPrefix(org.jclouds.filesystem.integration.FilesystemContainerIntegrationTest): Unexpected internal error near index 16
      testListRootUsesDelimiter(org.jclouds.filesystem.integration.FilesystemContainerIntegrationTest): java.io.IOException: Could not delete: .\target\basedir\zack-blobstore1\file
      testPutTwiceIsOkAndDoesntOverwrite(org.jclouds.filesystem.integration.FilesystemContainerIntegrationTest): java.io.IOException: Could not delete: .\target\basedir\zack-blobstore2\string
      testNotWithDetails(org.jclouds.filesystem.integration.FilesystemContainerIntegrationTest): java.io.IOException: Could not delete: .\target\basedir\zack-blobstore3\bytes

        Attachments

          Activity

            People

            • Assignee:
              zack-s Zack Shoylev
              Reporter:
              zack-s Zack Shoylev
            • Votes:
              0 Vote for this issue
              Watchers:
              4 Start watching this issue

              Dates

              • Created:
                Updated:
                Resolved: