Uploaded image for project: 'Infrastructure'
  1. Infrastructure
  2. INFRA-7984

Frequent unreachable server https://repository.apache.org/service/local/staging/deploy/maven2

    Details

    • Type: Bug
    • Status: Closed
    • Priority: Critical
    • Resolution: Cannot Reproduce
    • Fix Version/s: Dec 2015
    • Component/s: None
    • Labels:
      None

      Description

      When trying to release, I get many errors while running a mvn release:perform or a mvn release:deploy.

      Here is a collection of 4 of those random errors :


      Error 1 :
      ---------


      luc14-1-78-235-65-101:apacheds elecharny$ mvn deploy
      [INFO] Scanning for projects...
      [INFO] ------------------------------------------------------------------------
      [INFO] Reactor Build Order:
      [INFO]
      [INFO] ApacheDS
      [INFO] ApacheDS I18n
      [INFO] ApacheDS Core Constants
      [INFO] ApacheDS Core API
      [INFO] ApacheDS Core Shared
      [INFO] ApacheDS Interceptors
      [INFO] ApacheDS AdministrativePoint Interceptor
      [INFO] ApacheDS Authentication Interceptor
      [INFO] ApacheDS Interceptor to increment numeric attributes
      [INFO] ApacheDS Authorization Interceptor
      [INFO] ApacheDS ChangeLog Interceptor
      [INFO] ApacheDS Collective Attribute Interceptor
      [INFO] ApacheDS Event Interceptor
      [INFO] ApacheDS Exception Interceptor
      [INFO] ApacheDS Journal Interceptor
      [INFO] ApacheDS Normalization Interceptor
      [INFO] ApacheDS Operational Attribute Interceptor
      [INFO] ApacheDS Referral Interceptor
      [INFO] ApacheDS Schema Interceptor
      [INFO] ApacheDS Subtree Interceptor
      [INFO] ApacheDS Triggers Interceptor
      [INFO] ApacheDS Core
      [INFO] ApacheDS Core AVL
      [INFO] ApacheDS Generalized (X) DBM Partition
      [INFO] ApacheDS LDIF Partition
      [INFO] ApacheDS JDBM Partition
      [INFO] ApacheDS Mavibot Partition
      [INFO] ApacheDS Core Annotations
      [INFO] ApacheDS Core JNDI
      [INFO] ApacheDS Protocol Kerberos Codec
      [INFO] ApacheDS Interceptors for Kerberos
      [INFO] ApacheDS Protocol Dhcp
      [INFO] ApacheDS Protocol Shared
      [INFO] ApacheDS Protocol Dns
      [INFO] ApacheDS Protocol Kerberos
      [INFO] ApacheDS Protocol Ldap
      [INFO] ApacheDS Protocol Ntp
      [INFO] Apacheds Server Annotations
      [INFO] ApacheDS Server Config
      [INFO] ApacheDS Server JNDI
      [INFO] ApacheDS Test Framework
      [INFO] ApacheDS All
      [INFO] ApacheDS Logger Interceptor
      [INFO] ApacheDS Password Hashing Interceptor
      [INFO] ApacheDS Core Integration
      [INFO] ApacheDS Protocol Kerberos Test
      [INFO] ApacheDS Server Integration
      [INFO] ApacheDS DirectoryService-WebApp bridge
      [INFO] ApacheDS Jetty HTTP Server Integration
      [INFO] ApacheDS Service Builder
      [INFO] Apache Directory LDAP Client API test
      [INFO] kerberos-client
      [INFO] ApacheDS Service
      [INFO] ApacheDS Wrapper
      [INFO] ApacheDS Installers Maven Plugin
      [INFO] ApacheDS Installers
      [INFO] ApacheDS Mavibot bulkloader
      [INFO]
      [INFO] Using the builder org.apache.maven.lifecycle.internal.builder.singlethreaded.SingleThreadedBuilder with a thread count of 1
      [INFO]
      [INFO] ------------------------------------------------------------------------
      [INFO] Building ApacheDS 2.0.0-M17-SNAPSHOT
      [INFO] ------------------------------------------------------------------------
      [INFO]
      ...
      Uploading: https://repository.apache.org/content/repositories/snapshots/org/apache/directory/server/apacheds-interceptors-normalization/2.0.0-M17-SNAPSHOT/apacheds-interceptors-normalization-2.0.0-M17-20140630.062701-77.pom
      Uploaded: https://repository.apache.org/content/repositories/snapshots/org/apache/directory/server/apacheds-interceptors-normalization/2.0.0-M17-SNAPSHOT/apacheds-interceptors-normalization-2.0.0-M17-20140630.062701-77.pom (5 KB at 1.1 KB/sec)
      [INFO] ------------------------------------------------------------------------
      [INFO] Reactor Summary:
      [INFO]
      [INFO] ApacheDS .......................................... SUCCESS [ 9.625 s]
      [INFO] ApacheDS I18n ..................................... SUCCESS [ 6.309 s]
      [INFO] ApacheDS Core Constants ........................... SUCCESS [ 5.547 s]
      [INFO] ApacheDS Core API ................................. SUCCESS [ 38.415 s]
      [INFO] ApacheDS Core Shared .............................. SUCCESS [ 24.870 s]
      [INFO] ApacheDS Interceptors ............................. SUCCESS [ 4.946 s]
      [INFO] ApacheDS AdministrativePoint Interceptor .......... SUCCESS [ 11.829 s]
      [INFO] ApacheDS Authentication Interceptor ............... SUCCESS [ 12.010 s]
      [INFO] ApacheDS Interceptor to increment numeric attributes SUCCESS [ 7.926 s]
      [INFO] ApacheDS Authorization Interceptor ................ SUCCESS [ 13.671 s]
      [INFO] ApacheDS ChangeLog Interceptor .................... SUCCESS [ 10.040 s]
      [INFO] ApacheDS Collective Attribute Interceptor ......... SUCCESS [ 8.083 s]
      [INFO] ApacheDS Event Interceptor ........................ SUCCESS [ 6.817 s]
      [INFO] ApacheDS Exception Interceptor .................... SUCCESS [ 6.292 s]
      [INFO] ApacheDS Journal Interceptor ...................... SUCCESS [ 11.366 s]
      [INFO] ApacheDS Normalization Interceptor ................ FAILURE [ 37.014 s]
      [INFO] ApacheDS Operational Attribute Interceptor ........ SKIPPED
      ...
      [INFO] ApacheDS Mavibot bulkloader ....................... SKIPPED
      [INFO] ------------------------------------------------------------------------
      [INFO] BUILD FAILURE
      [INFO] ------------------------------------------------------------------------
      [INFO] Total time: 03:36 min
      [INFO] Finished at: 2014-06-30T08:27:36+01:00
      [INFO] Final Memory: 53M/247M
      [INFO] ------------------------------------------------------------------------
      [ERROR] Failed to execute goal org.apache.maven.plugins:maven-deploy-plugin:2.8.1:deploy (default-deploy) on project apacheds-interceptors-normalization: Failed to deploy artifacts: Could not transfer artifact org.apache.directory.server:apacheds-interceptors-normalization:jar:2.0.0-M17-20140630.062701-77 from/to apache.snapshots.https (https://repository.apache.org/content/repositories/snapshots): Failed to transfer file: https://repository.apache.org/content/repositories/snapshots/org/apache/directory/server/apacheds-interceptors-normalization/2.0.0-M17-SNAPSHOT/apacheds-interceptors-normalization-2.0.0-M17-20140630.062701-77.jar. Return code is: 502, ReasonPhrase: Proxy Error. -> [Help 1]
      [ERROR]
      [ERROR] To see the full stack trace of the errors, re-run Maven with the -e switch.
      [ERROR] Re-run Maven using the -X switch to enable full debug logging.
      [ERROR]
      [ERROR] For more information about the errors and possible solutions, please read the following articles:
      [ERROR] [Help 1] http://cwiki.apache.org/confluence/display/MAVEN/MojoExecutionException
      [ERROR]
      [ERROR] After correcting the problems, you can resume the build with the command
      [ERROR] mvn <goals> -rf :apacheds-interceptors-normalization






      Error 2 :
      ---------




      luc14-1-78-235-65-101:apacheds elecharny$ mvn release:perform
      [INFO] Scanning for projects...
      [INFO] ------------------------------------------------------------------------
      [INFO] Reactor Build Order:
      [INFO]
      [INFO] ApacheDS
      [INFO] ApacheDS I18n
      [INFO] ApacheDS Core Constants
      ...
      [INFO] Uploading: https://repository.apache.org/service/local/staging/deploy/maven2/org/apache/directory/server/apacheds-interceptors-admin/2.0.0-M17/apacheds-interceptors-admin-2.0.0-M17-javadoc.jar
      [INFO] 2/45 KB
      [INFO] 4/45 KB
      [INFO] 6/45 KB
      [INFO] 8/45 KB
      [INFO] 10/45 KB
      [INFO] 12/45 KB
      [INFO] 14/45 KB
      [INFO] 16/45 KB
      [INFO] 18/45 KB
      [INFO] 20/45 KB
      [INFO] 22/45 KB
      [INFO] 24/45 KB
      [INFO] 26/45 KB
      [INFO] 28/45 KB
      [INFO] 30/45 KB
      [INFO] 32/45 KB
      [INFO] 34/45 KB
      [INFO] 36/45 KB
      [INFO] 38/45 KB
      [INFO] 40/45 KB
      [INFO] 42/45 KB
      [INFO] 44/45 KB
      [INFO] 45/45 KB
      [INFO]
      [INFO] [INFO] ------------------------------------------------------------------------
      [INFO] [INFO] Reactor Summary:
      [INFO] [INFO]
      [INFO] [INFO] ApacheDS .......................................... SUCCESS [01:25 min]
      [INFO] [INFO] ApacheDS I18n ..................................... SUCCESS [ 14.079 s]
      [INFO] [INFO] ApacheDS Core Constants ........................... SUCCESS [ 12.005 s]
      [INFO] [INFO] ApacheDS Core API ................................. SUCCESS [ 35.083 s]
      [INFO] [INFO] ApacheDS Core Shared .............................. SUCCESS [ 18.109 s]
      [INFO] [INFO] ApacheDS Interceptors ............................. SUCCESS [ 4.404 s]
      [INFO] [INFO] ApacheDS AdministrativePoint Interceptor .......... FAILURE [ 14.428 s]
      [INFO] [INFO] ApacheDS Authentication Interceptor ............... SKIPPED
      [INFO] [INFO] ApacheDS Mavibot bulkloader ....................... SKIPPED
      [INFO] [INFO] ------------------------------------------------------------------------
      [INFO] [INFO] BUILD FAILURE
      [INFO] [INFO] ------------------------------------------------------------------------
      [INFO] [INFO] Total time: 03:05 min
      [INFO] [INFO] Finished at: 2014-06-30T09:46:27+01:00
      [INFO] [INFO] Final Memory: 61M/247M
      [INFO] [INFO] ------------------------------------------------------------------------
      [INFO] [ERROR] Failed to execute goal org.apache.maven.plugins:maven-deploy-plugin:2.8.1:deploy (default-deploy) on project apacheds-interceptors-admin: Failed to deploy artifacts: Could not transfer artifact org.apache.directory.server:apacheds-interceptors-admin:jar:javadoc:2.0.0-M17 from/to apache.releases.https (https://repository.apache.org/service/local/staging/deploy/maven2): The target server failed to respond -> [Help 1]
      [INFO] [ERROR]
      [INFO] [ERROR] To see the full stack trace of the errors, re-run Maven with the -e switch.
      [INFO] [ERROR] Re-run Maven using the -X switch to enable full debug logging.
      [INFO] [ERROR]
      [INFO] [ERROR] For more information about the errors and possible solutions, please read the following articles:
      [INFO] [ERROR] [Help 1] http://cwiki.apache.org/confluence/display/MAVEN/MojoExecutionException
      [INFO] [ERROR]
      [INFO] [ERROR] After correcting the problems, you can resume the build with the command
      [INFO] [ERROR] mvn <goals> -rf :apacheds-interceptors-admin
      [INFO] ------------------------------------------------------------------------
      [INFO] Reactor Summary:
      [INFO]
      [INFO] ApacheDS .......................................... FAILURE [03:32 min]
      ...
      [INFO] ApacheDS Mavibot bulkloader ....................... SKIPPED
      [INFO] ------------------------------------------------------------------------
      [INFO] BUILD FAILURE
      [INFO] ------------------------------------------------------------------------
      [INFO] Total time: 03:35 min
      [INFO] Finished at: 2014-06-30T09:46:28+01:00
      [INFO] Final Memory: 37M/247M
      [INFO] ------------------------------------------------------------------------
      [ERROR] Failed to execute goal org.apache.maven.plugins:maven-release-plugin:2.5:perform (default-cli) on project apacheds-parent: Maven execution failed, exit code: '1' -> [Help 1]
      [ERROR]
      [ERROR] To see the full stack trace of the errors, re-run Maven with the -e switch.
      [ERROR] Re-run Maven using the -X switch to enable full debug logging.
      [ERROR]
      [ERROR] For more information about the errors and possible solutions, please read the following articles:
      [ERROR] [Help 1] http://cwiki.apache.org/confluence/display/MAVEN/MojoExecutionException




      Error 3 :
      ---------



      luc14-1-78-235-65-101:apacheds elecharny$ mvn release:perform
      [INFO] Scanning for projects...
      [INFO] ------------------------------------------------------------------------
      [INFO] Reactor Build Order:
      [INFO]
      [INFO] ApacheDS
      ...
      [INFO] ApacheDS Mavibot bulkloader
      [INFO]
      [INFO] Using the builder org.apache.maven.lifecycle.internal.builder.singlethreaded.SingleThreadedBuilder with a thread count of 1
      [INFO]
      [INFO] ------------------------------------------------------------------------
      [INFO] Building ApacheDS 2.0.0-M18-SNAPSHOT
      [INFO] ------------------------------------------------------------------------
      [INFO]
      [INFO] --- maven-release-plugin:2.5:perform (default-cli) @ apacheds-parent ---
      [INFO] Checking out the project to perform the release ...
      [INFO] Executing: /bin/sh -c cd /Users/elecharny/apacheds/trunks/apacheds/target && svn --non-interactive checkout https://svn.apache.org/repos/asf/directory/apacheds/tags/2.0.0-M17 /Users/elecharny/apacheds/trunks/apacheds/target/checkout
      [INFO] Working directory: /Users/elecharny/apacheds/trunks/apacheds/target
      [INFO] Invoking perform goals in directory /Users/elecharny/apacheds/trunks/apacheds/target/checkout
      [INFO] Executing goals 'deploy'...
      [WARNING] Maven will be executed in interactive mode, but no input stream has been configured for this MavenInvoker instance.
      [INFO] [INFO] Scanning for projects...
      [INFO] [INFO] ------------------------------------------------------------------------
      [INFO] [INFO] Reactor Build Order:
      [INFO] [INFO]
      [INFO] [INFO] ApacheDS
      ...
      [INFO] Uploading: https://repository.apache.org/service/local/staging/deploy/maven2/org/apache/directory/server/apacheds-interceptors-authn/2.0.0-M17/apacheds-interceptors-authn-2.0.0-M17.pom
      [INFO] 2/6 KB
      [INFO] 4/6 KB
      [INFO] 6/6 KB
      [INFO]
      [INFO] Uploaded: https://repository.apache.org/service/local/staging/deploy/maven2/org/apache/directory/server/apacheds-interceptors-authn/2.0.0-M17/apacheds-interceptors-authn-2.0.0-M17.pom (6 KB at 2.9 KB/sec)
      [INFO] [INFO] ------------------------------------------------------------------------
      [INFO] [INFO] Reactor Summary:
      [INFO] [INFO]
      [INFO] [INFO] ApacheDS .......................................... SUCCESS [01:07 min]
      [INFO] [INFO] ApacheDS I18n ..................................... SUCCESS [ 18.389 s]
      [INFO] [INFO] ApacheDS Core Constants ........................... SUCCESS [ 16.019 s]
      [INFO] [INFO] ApacheDS Core API ................................. SUCCESS [ 35.536 s]
      [INFO] [INFO] ApacheDS Core Shared .............................. SUCCESS [ 16.303 s]
      [INFO] [INFO] ApacheDS Interceptors ............................. SUCCESS [ 3.810 s]
      [INFO] [INFO] ApacheDS AdministrativePoint Interceptor .......... SUCCESS [ 15.264 s]
      [INFO] [INFO] ApacheDS Authentication Interceptor ............... FAILURE [ 6.744 s]
      [INFO] [INFO] ApacheDS Interceptor to increment numeric attributes SKIPPED
      ...
      [INFO] [INFO] ApacheDS Mavibot bulkloader ....................... SKIPPED
      [INFO] [INFO] ------------------------------------------------------------------------
      [INFO] [INFO] BUILD FAILURE
      [INFO] [INFO] ------------------------------------------------------------------------
      [INFO] [INFO] Total time: 03:00 min
      [INFO] [INFO] Finished at: 2014-06-30T09:50:45+01:00
      [INFO] [INFO] Final Memory: 62M/247M
      [INFO] [INFO] ------------------------------------------------------------------------
      [INFO] [ERROR] Failed to execute goal org.apache.maven.plugins:maven-deploy-plugin:2.8.1:deploy (default-deploy) on project apacheds-interceptors-authn: Failed to deploy artifacts: Could not transfer artifact org.apache.directory.server:apacheds-interceptors-authn:jar:2.0.0-M17 from/to apache.releases.https (https://repository.apache.org/service/local/staging/deploy/maven2): The target server failed to respond -> [Help 1]
      [INFO] [ERROR]
      [INFO] [ERROR] To see the full stack trace of the errors, re-run Maven with the -e switch.
      [INFO] [ERROR] Re-run Maven using the -X switch to enable full debug logging.
      [INFO] [ERROR]
      [INFO] [ERROR] For more information about the errors and possible solutions, please read the following articles:
      [INFO] [ERROR] [Help 1] http://cwiki.apache.org/confluence/display/MAVEN/MojoExecutionException
      [INFO] [ERROR]
      [INFO] [ERROR] After correcting the problems, you can resume the build with the command
      [INFO] [ERROR] mvn <goals> -rf :apacheds-interceptors-authn
      [INFO] ------------------------------------------------------------------------
      [INFO] Reactor Summary:
      [INFO]
      [INFO] ApacheDS .......................................... FAILURE [03:26 min]
      ...
      [INFO] ApacheDS Mavibot bulkloader ....................... SKIPPED
      [INFO] ------------------------------------------------------------------------
      [INFO] BUILD FAILURE
      [INFO] ------------------------------------------------------------------------
      [INFO] Total time: 03:28 min
      [INFO] Finished at: 2014-06-30T09:50:45+01:00
      [INFO] Final Memory: 37M/247M
      [INFO] ------------------------------------------------------------------------
      [ERROR] Failed to execute goal org.apache.maven.plugins:maven-release-plugin:2.5:perform (default-cli) on project apacheds-parent: Maven execution failed, exit code: '1' -> [Help 1]
      [ERROR]
      [ERROR] To see the full stack trace of the errors, re-run Maven with the -e switch.
      [ERROR] Re-run Maven using the -X switch to enable full debug logging.
      [ERROR]
      [ERROR] For more information about the errors and possible solutions, please read the following articles:
      [ERROR] [Help 1] http://cwiki.apache.org/confluence/display/MAVEN/MojoExecutionException


      Error 4 :
      ---------



      luc14-1-78-235-65-101:apacheds elecharny$ mvn release:perform
      [INFO] Scanning for projects...
      [INFO] ------------------------------------------------------------------------
      [INFO] Reactor Build Order:
      [INFO]
      [INFO] ApacheDS
      [INFO] ApacheDS I18n
      ...
      [INFO] Uploading: https://repository.apache.org/service/local/staging/deploy/maven2/org/apache/directory/server/apacheds-i18n/2.0.0-M17/apacheds-i18n-2.0.0-M17.pom
      [INFO] 2/3 KB
      [INFO] 3/3 KB
      [INFO]
      [INFO] Uploaded: https://repository.apache.org/service/local/staging/deploy/maven2/org/apache/directory/server/apacheds-i18n/2.0.0-M17/apacheds-i18n-2.0.0-M17.pom (3 KB at 1.1 KB/sec)
      [INFO] [INFO] ------------------------------------------------------------------------
      [INFO] [INFO] Reactor Summary:
      [INFO] [INFO]
      [INFO] [INFO] ApacheDS .......................................... SUCCESS [01:06 min]
      [INFO] [INFO] ApacheDS I18n ..................................... FAILURE [ 6.706 s]
      ...
      [INFO] [INFO] ApacheDS Mavibot bulkloader ....................... SKIPPED
      [INFO] [INFO] ------------------------------------------------------------------------
      [INFO] [INFO] BUILD FAILURE
      [INFO] [INFO] ------------------------------------------------------------------------
      [INFO] [INFO] Total time: 01:14 min
      [INFO] [INFO] Finished at: 2014-06-30T09:53:31+01:00
      [INFO] [INFO] Final Memory: 53M/247M
      [INFO] [INFO] ------------------------------------------------------------------------
      [INFO] [ERROR] Failed to execute goal org.apache.maven.plugins:maven-deploy-plugin:2.8.1:deploy (default-deploy) on project apacheds-i18n: Failed to deploy artifacts: Could not transfer artifact org.apache.directory.server:apacheds-i18n:jar:2.0.0-M17 from/to apache.releases.https (https://repository.apache.org/service/local/staging/deploy/maven2): The target server failed to respond -> [Help 1]
      [INFO] [ERROR]
      [INFO] [ERROR] To see the full stack trace of the errors, re-run Maven with the -e switch.
      [INFO] [ERROR] Re-run Maven using the -X switch to enable full debug logging.
      [INFO] [ERROR]
      [INFO] [ERROR] For more information about the errors and possible solutions, please read the following articles:
      [INFO] [ERROR] [Help 1] http://cwiki.apache.org/confluence/display/MAVEN/MojoExecutionException
      [INFO] [ERROR]
      [INFO] [ERROR] After correcting the problems, you can resume the build with the command
      [INFO] [ERROR] mvn <goals> -rf :apacheds-i18n
      [INFO] ------------------------------------------------------------------------
      [INFO] Reactor Summary:
      [INFO]
      [INFO] ApacheDS .......................................... FAILURE [01:40 min]
      [INFO] ApacheDS I18n ..................................... SKIPPED
      ...
      [INFO] ApacheDS Mavibot bulkloader ....................... SKIPPED
      [INFO] ------------------------------------------------------------------------
      [INFO] BUILD FAILURE
      [INFO] ------------------------------------------------------------------------
      [INFO] Total time: 01:42 min
      [INFO] Finished at: 2014-06-30T09:53:31+01:00
      [INFO] Final Memory: 37M/247M
      [INFO] ------------------------------------------------------------------------
      [ERROR] Failed to execute goal org.apache.maven.plugins:maven-release-plugin:2.5:perform (default-cli) on project apacheds-parent: Maven execution failed, exit code: '1' -> [Help 1]
      [ERROR]
      [ERROR] To see the full stack trace of the errors, re-run Maven with the -e switch.
      [ERROR] Re-run Maven using the -X switch to enable full debug logging.
      [ERROR]
      [ERROR] For more information about the errors and possible solutions, please read the following articles:
      [ERROR] [Help 1] http://cwiki.apache.org/confluence/display/MAVEN/MojoExecutionException

        Activity

        Hide
        mgrigorov Martin Grigorov added a comment -
        It may be related or not but many Wicket BuildBot tasks fail with errors like:

        Failed to execute goal org.apache.maven.plugins:maven-deploy-plugin:2.6:deploy (default-deploy) on project wicket-parent: Failed to retrieve remote metadata org.apache.wicket:wicket-parent:7.0.0-SNAPSHOT/maven-metadata.xml: Could not transfer metadata org.apache.wicket:wicket-parent:7.0.0-SNAPSHOT/maven-metadata.xml from/to apache.snapshots.https (https://repository.apache.org/content/repositories/snapshots): Failed to transfer file: https://repository.apache.org/content/repositories/snapshots/org/apache/wicket/wicket-parent/7.0.0-SNAPSHOT/maven-metadata.xml. Return code is: 503 , ReasonPhrase:Service Temporarily Unavailable. -> [Help 1]

        See
        http://ci.apache.org/builders/wicket-master/builds/56/steps/compile/logs/stdio
        http://ci.apache.org/builders/wicket-master/builds/58/steps/compile/logs/stdio
        http://ci.apache.org/builders/wicket-master/builds/59/steps/compile/logs/stdio
        http://ci.apache.org/builders/wicket-master/builds/74/steps/compile/logs/stdio
        Show
        mgrigorov Martin Grigorov added a comment - It may be related or not but many Wicket BuildBot tasks fail with errors like: Failed to execute goal org.apache.maven.plugins:maven-deploy-plugin:2.6:deploy (default-deploy) on project wicket-parent: Failed to retrieve remote metadata org.apache.wicket:wicket-parent:7.0.0-SNAPSHOT/maven-metadata.xml: Could not transfer metadata org.apache.wicket:wicket-parent:7.0.0-SNAPSHOT/maven-metadata.xml from/to apache.snapshots.https ( https://repository.apache.org/content/repositories/snapshots): Failed to transfer file: https://repository.apache.org/content/repositories/snapshots/org/apache/wicket/wicket-parent/7.0.0-SNAPSHOT/maven-metadata.xml . Return code is: 503 , ReasonPhrase:Service Temporarily Unavailable. -> [Help 1] See http://ci.apache.org/builders/wicket-master/builds/56/steps/compile/logs/stdio http://ci.apache.org/builders/wicket-master/builds/58/steps/compile/logs/stdio http://ci.apache.org/builders/wicket-master/builds/59/steps/compile/logs/stdio http://ci.apache.org/builders/wicket-master/builds/74/steps/compile/logs/stdio
        Hide
        elecharny Emmanuel Lecharny added a comment - Reporter
        FTR, there is one workaround :
        - cd target/checkout
        - mvm clean deploy -Papache-release

        That allows you to cut the release no matter what, even if you have to restart many times (at least, from the target/checkout directory, you can specify the -rf <failed module>)

        This is really a weak workaround though. I had to restart the mvn deploy 7 times before being done. That does not fit with the 'release soon, release often' mantra ;-)

        OTOH, I also have filled a Maven Release JIRA : https://jira.codehaus.org/browse/MRELEASE-880 because the release plugin should retry when a connection to the server failed (or at least ask the user if it should retry.)
        Show
        elecharny Emmanuel Lecharny added a comment - Reporter FTR, there is one workaround : - cd target/checkout - mvm clean deploy -Papache-release That allows you to cut the release no matter what, even if you have to restart many times (at least, from the target/checkout directory, you can specify the -rf <failed module>) This is really a weak workaround though. I had to restart the mvn deploy 7 times before being done. That does not fit with the 'release soon, release often' mantra ;-) OTOH, I also have filled a Maven Release JIRA : https://jira.codehaus.org/browse/MRELEASE-880 because the release plugin should retry when a connection to the server failed (or at least ask the user if it should retry.)
        Hide
        brianf Brian Fox added a comment -
        Making some changes to allow better visibility into these errors. Please continue to report instances along with the times they occurred so I can troubleshoot.
        Show
        brianf Brian Fox added a comment - Making some changes to allow better visibility into these errors. Please continue to report instances along with the times they occurred so I can troubleshoot.
        Hide
        brianf Brian Fox added a comment -
        Noticed this morning that the nightly snapshot remover was thrashing the disk io. Stopped the task and moved it to weekly on sat 00:15 while we investigate improvements.
        Show
        brianf Brian Fox added a comment - Noticed this morning that the nightly snapshot remover was thrashing the disk io. Stopped the task and moved it to weekly on sat 00:15 while we investigate improvements.
        Hide
        elecharny Emmanuel Lecharny added a comment - Reporter
        Brian, I saw that you requested a change on the timeout delay. It might have a positive impact on the release process.

        Do you think we should put this JIRA on hold until the next release, so that we can see if the patch is suffisant ?
        Show
        elecharny Emmanuel Lecharny added a comment - Reporter Brian, I saw that you requested a change on the timeout delay. It might have a positive impact on the release process. Do you think we should put this JIRA on hold until the next release, so that we can see if the patch is suffisant ?
        Hide
        brianf Brian Fox added a comment -
        the timeout didn't stick but I've resolved some resource contentions issues. There's more to be done here I think.
        Show
        brianf Brian Fox added a comment - the timeout didn't stick but I've resolved some resource contentions issues. There's more to be done here I think.
        Hide
        pctony Tony Stevenson added a comment -
        Timeout now set to 60s. I have no idea why it didnt stick before.
        Show
        pctony Tony Stevenson added a comment - Timeout now set to 60s. I have no idea why it didnt stick before.
        Hide
        brianf Brian Fox added a comment -
        No new reports so declaring this fixed.
        Show
        brianf Brian Fox added a comment - No new reports so declaring this fixed.
        Hide
        elecharny Emmanuel Lecharny added a comment - Reporter
        Thanks Brian. I have done a release last week, and it was a no brainer. I guess that the applied fixes made the trick.
        Show
        elecharny Emmanuel Lecharny added a comment - Reporter Thanks Brian. I have done a release last week, and it was a no brainer. I guess that the applied fixes made the trick.
        Hide
        andyg Andy Gumbrecht added a comment -
        Yes, thanks Brian. Everything seems much more stable now.

        I made one change on the deployments I was performing this week and things got much better - Setting this property worked wonders for me:

        http://maven.apache.org/plugins/maven-deploy-plugin/deploy-mojo.html#retryFailedDeploymentCount

        I may suggest to the authors that the default should actually be 2 rather than 1, as that could really help.
        Show
        andyg Andy Gumbrecht added a comment - Yes, thanks Brian. Everything seems much more stable now. I made one change on the deployments I was performing this week and things got much better - Setting this property worked wonders for me: http://maven.apache.org/plugins/maven-deploy-plugin/deploy-mojo.html#retryFailedDeploymentCount I may suggest to the authors that the default should actually be 2 rather than 1, as that could really help.
        Hide
        dashorst Martijn Dashorst added a comment -
        Is an issue again... couldn't upload a release to nexus last friday.
        Show
        dashorst Martijn Dashorst added a comment - Is an issue again... couldn't upload a release to nexus last friday.
        Hide
        rombert Robert Munteanu added a comment -
        I have this problem as well when trying to upload artifacts using Maven for the Sling project.
        Show
        rombert Robert Munteanu added a comment - I have this problem as well when trying to upload artifacts using Maven for the Sling project.
        Hide
        andyg Andy Gumbrecht added a comment -
        Did you try it with my suggestion above?
        Show
        andyg Andy Gumbrecht added a comment - Did you try it with my suggestion above?
        Hide
        dashorst Martijn Dashorst added a comment -
        Yes, and this morning I got a 401 error (not authenticated) half way through the build.
        Show
        dashorst Martijn Dashorst added a comment - Yes, and this morning I got a 401 error (not authenticated) half way through the build.
        Hide
        rombert Robert Munteanu added a comment -
        For me it still fails when running

           mvn release:prepare release:perform -DretryFailedDeploymentCount=3

        with the final error being

        [INFO] [ERROR] Failed to execute goal org.apache.maven.plugins:maven-deploy-plugin:2.8.1:deploy (default-deploy) on project org.apache.sling.commons.json: Failed to deploy artifacts: Could not transfer artifact org.apache.sling:org.apache.sling.commons.json:jar:2.0.8 from/to apache.releases.https (https://repository.apache.org/service/local/staging/deploy/maven2): Failed to transfer file: https://repository.apache.org/service/local/staging/deploy/maven2/org/apache/sling/org.apache.sling.commons.json/2.0.8/org.apache.sling.commons.json-2.0.8.jar. Return code is: 502, ReasonPhrase: Proxy Error. -> [Help 1]

        Show
        rombert Robert Munteanu added a comment - For me it still fails when running    mvn release:prepare release:perform -DretryFailedDeploymentCount=3 with the final error being [INFO] [ERROR] Failed to execute goal org.apache.maven.plugins:maven-deploy-plugin:2.8.1:deploy (default-deploy) on project org.apache.sling.commons.json: Failed to deploy artifacts: Could not transfer artifact org.apache.sling:org.apache.sling.commons.json:jar:2.0.8 from/to apache.releases.https ( https://repository.apache.org/service/local/staging/deploy/maven2): Failed to transfer file: https://repository.apache.org/service/local/staging/deploy/maven2/org/apache/sling/org.apache.sling.commons.json/2.0.8/org.apache.sling.commons.json-2.0.8.jar . Return code is: 502, ReasonPhrase: Proxy Error. -> [Help 1]
        Hide
        thetaphi Uwe Schindler added a comment -
        Hi, we see the same problems on Apache Lucene/Solr builds, and also for Apache TIKA builds. The nexus server always responds with error 502.

        In our case, we use maven-ant-tasks to deploy, so -DretryFailedDeploymentCount cannot be specified.
        Show
        thetaphi Uwe Schindler added a comment - Hi, we see the same problems on Apache Lucene/Solr builds, and also for Apache TIKA builds. The nexus server always responds with error 502. In our case, we use maven-ant-tasks to deploy, so -DretryFailedDeploymentCount cannot be specified.
        Hide
        dashorst Martijn Dashorst added a comment -
        And now my build has been stuck for about 45 minutes or so on getting confirmation of an upload:

        [INFO] Uploaded: https://repository.apache.org/service/local/staging/deploy/maven2/org/apache/wicket/wicket-devutils/7.0.0-M3/wicket-devutils-7.0.0-M3-test-sources.jar.asc (244 B at 0.0 KB/sec)
        [INFO] Uploading: https://repository.apache.org/service/local/staging/deploy/maven2/org/apache/wicket/wicket-devutils/7.0.0-M3/wicket-devutils-7.0.0-M3-javadoc.jar.asc
        [INFO] 244/244 B
        [INFO]
        [INFO] Uploaded: https://repository.apache.org/service/local/staging/deploy/maven2/org/apache/wicket/wicket-devutils/7.0.0-M3/wicket-devutils-7.0.0-M3-javadoc.jar.asc (244 B at 0.0 KB/sec)
        [INFO] Uploading: https://repository.apache.org/service/local/staging/deploy/maven2/org/apache/wicket/wicket-devutils/7.0.0-M3/wicket-devutils-7.0.0-M3.jar.asc
        [INFO] 244/244 B
        [INFO] [WARNING] Failed to upload SHA-1 checksum for /Users/wicket/Workspaces/wicket/wicket-7.x/target/checkout/wicket-devutils/target/wicket-devutils-7.0.0-M3.jar.asc: Read timed out
        [INFO]

        Show
        dashorst Martijn Dashorst added a comment - And now my build has been stuck for about 45 minutes or so on getting confirmation of an upload: [INFO] Uploaded: https://repository.apache.org/service/local/staging/deploy/maven2/org/apache/wicket/wicket-devutils/7.0.0-M3/wicket-devutils-7.0.0-M3-test-sources.jar.asc (244 B at 0.0 KB/sec) [INFO] Uploading: https://repository.apache.org/service/local/staging/deploy/maven2/org/apache/wicket/wicket-devutils/7.0.0-M3/wicket-devutils-7.0.0-M3-javadoc.jar.asc [INFO] 244/244 B [INFO] [INFO] Uploaded: https://repository.apache.org/service/local/staging/deploy/maven2/org/apache/wicket/wicket-devutils/7.0.0-M3/wicket-devutils-7.0.0-M3-javadoc.jar.asc (244 B at 0.0 KB/sec) [INFO] Uploading: https://repository.apache.org/service/local/staging/deploy/maven2/org/apache/wicket/wicket-devutils/7.0.0-M3/wicket-devutils-7.0.0-M3.jar.asc [INFO] 244/244 B [INFO] [WARNING] Failed to upload SHA-1 checksum for /Users/wicket/Workspaces/wicket/wicket-7.x/target/checkout/wicket-devutils/target/wicket-devutils-7.0.0-M3.jar.asc: Read timed out [INFO]
        Hide
        elecharny Emmanuel Lecharny added a comment - Reporter
        it does it again...

        [INFO] [ERROR] Failed to execute goal org.apache.maven.plugins:maven-deploy-plugin:2.8.1:deploy (default-deploy) on project apacheds-i18n: Failed to deploy artifacts: Could not transfer artifact org.apache.directory.server:apacheds-i18n:jar:2.0.0-M18 from/to apache.releases.https (https://repository.apache.org/service/local/staging/deploy/maven2): The target server failed to respond -> [Help 1]

        The issue has to be reopened...
        Show
        elecharny Emmanuel Lecharny added a comment - Reporter it does it again... [INFO] [ERROR] Failed to execute goal org.apache.maven.plugins:maven-deploy-plugin:2.8.1:deploy (default-deploy) on project apacheds-i18n: Failed to deploy artifacts: Could not transfer artifact org.apache.directory.server:apacheds-i18n:jar:2.0.0-M18 from/to apache.releases.https ( https://repository.apache.org/service/local/staging/deploy/maven2): The target server failed to respond -> [Help 1] The issue has to be reopened...
        Hide
        elecharny Emmanuel Lecharny added a comment - Reporter
        The issue is still existing
        Show
        elecharny Emmanuel Lecharny added a comment - Reporter The issue is still existing
        Hide
        elecharny Emmanuel Lecharny added a comment - Reporter
        Trying to release ApacheDS today : many failures like :

        [INFO] BUILD FAILURE
        [INFO] ------------------------------------------------------------------------
        [INFO] Total time: 05:53 min
        [INFO] Finished at: 2014-11-19T17:19:33+01:00
        [INFO] Final Memory: 82M/250M
        [INFO] ------------------------------------------------------------------------
        [ERROR] Failed to execute goal org.apache.maven.plugins:maven-deploy-plugin:2.8.1:deploy (default-deploy) on project apacheds-core-jndi: Failed to deploy artifacts: Could not transfer artifact org.apache.directory.server:apacheds-core-jndi:jar:2.0.0-M19 from/to apache.releases.https (https://repository.apache.org/service/local/staging/deploy/maven2): The target server failed to respond -> [Help 1]

         (This is the fifth in a row)

        Show
        elecharny Emmanuel Lecharny added a comment - Reporter Trying to release ApacheDS today : many failures like : [INFO] BUILD FAILURE [INFO] ------------------------------------------------------------------------ [INFO] Total time: 05:53 min [INFO] Finished at: 2014-11-19T17:19:33+01:00 [INFO] Final Memory: 82M/250M [INFO] ------------------------------------------------------------------------ [ERROR] Failed to execute goal org.apache.maven.plugins:maven-deploy-plugin:2.8.1:deploy (default-deploy) on project apacheds-core-jndi: Failed to deploy artifacts: Could not transfer artifact org.apache.directory.server:apacheds-core-jndi:jar:2.0.0-M19 from/to apache.releases.https ( https://repository.apache.org/service/local/staging/deploy/maven2): The target server failed to respond -> [Help 1]  (This is the fifth in a row)
        Hide
        elecharny Emmanuel Lecharny added a comment - Reporter
        The issue has been closed, but the problem has *not* been fixed.

        I still have random failures, like :

        {code}
        ...
        [INFO] Uploaded: https://repository.apache.org/service/local/staging/deploy/maven2/org/apache/directory/api/api-asn1-api/1.0.0-M28/api-asn1-api-1.0.0-M28.pom (3 KB at 3.1 KB/sec)
        [INFO] [INFO] ------------------------------------------------------------------------
        [INFO] [INFO] Reactor Summary:
        [INFO] [INFO]
        [INFO] [INFO] Apache Directory LDAP API .......................... SUCCESS [ 10.041 s]
        [INFO] [INFO] Apache Directory LDAP API I18n ..................... SUCCESS [ 13.459 s]
        [INFO] [INFO] Apache Directory LDAP API Utilities ................ SUCCESS [ 17.582 s]
        [INFO] [INFO] Apache Directory API ASN.1 Parent .................. SUCCESS [ 3.564 s]
        [INFO] [INFO] Apache Directory API ASN.1 API ..................... FAILURE [ 5.917 s]
        [INFO] [INFO] Apache Directory API ASN.1 BER ..................... SKIPPED
        [INFO] [INFO] Apache Directory LDAP API Parent ................... SKIPPED
        [INFO] [INFO] Apache Directory LDAP API Model .................... SKIPPED
        [INFO] [INFO] Apache Directory LDAP API Codec Parent ............. SKIPPED
        [INFO] [INFO] Apache Directory LDAP API Codec Core ............... SKIPPED
        [INFO] [INFO] Apache Directory LDAP API Net Parent ............... SKIPPED
        [INFO] [INFO] Apache Directory LDAP API Network MINA ............. SKIPPED
        [INFO] [INFO] Apache Directory LDAP API Extras ................... SKIPPED
        [INFO] [INFO] Apache Directory LDAP API Extras Codec API ......... SKIPPED
        [INFO] [INFO] Apache Directory LDAP API Extras Codec ............. SKIPPED
        [INFO] [INFO] Apache Directory LDAP API Codec Standalone ......... SKIPPED
        [INFO] [INFO] Apache Directory LDAP API DSML Parent .............. SKIPPED
        [INFO] [INFO] Apache Directory LDAP API DSML Parser .............. SKIPPED
        [INFO] [INFO] Apache Directory LDAP API Extras ACI ............... SKIPPED
        [INFO] [INFO] Apache Directory LDAP API Schema Parent ............ SKIPPED
        [INFO] [INFO] Apache Directory LDAP API Schema Data .............. SKIPPED
        [INFO] [INFO] Apache Directory LDAP API Client Parent ............ SKIPPED
        [INFO] [INFO] Apache Directory LDAP API Client API ............... SKIPPED
        [INFO] [INFO] Apache Directory LDAP API DSML Engine .............. SKIPPED
        [INFO] [INFO] Apache Directory LDAP API Extras Util .............. SKIPPED
        [INFO] [INFO] Apache Directory LDAP API Extras Stored Procedures . SKIPPED
        [INFO] [INFO] Apache Directory LDAP API Extras Trigger ........... SKIPPED
        [INFO] [INFO] Apache Directory LDAP API Schema Converter ......... SKIPPED
        [INFO] [INFO] Apache Directory API All ........................... SKIPPED
        [INFO] [INFO] Apache Directory LDAP API Client All ............... SKIPPED
        [INFO] [INFO] Apache Directory API Integration Tests ............. SKIPPED
        [INFO] [INFO] Apache Directory API OSGi Integration Tests ........ SKIPPED
        [INFO] [INFO] Apache Directory LDAP API Distribution ............. SKIPPED
        [INFO] [INFO] ------------------------------------------------------------------------
        [INFO] [INFO] BUILD FAILURE
        [INFO] [INFO] ------------------------------------------------------------------------
        [INFO] [INFO] Total time: 52.145 s
        [INFO] [INFO] Finished at: 2015-01-09T01:45:54+01:00
        [INFO] [INFO] Final Memory: 44M/247M
        [INFO] [INFO] ------------------------------------------------------------------------
        [INFO] [ERROR] Failed to execute goal org.apache.maven.plugins:maven-deploy-plugin:2.8.2:deploy (default-deploy) on project api-asn1-api: Failed to deploy artifacts: Could not transfer artifact org.apache.directory.api:api-asn1-api:jar:1.0.0-M28 from/to apache.releases.https (https://repository.apache.org/service/local/staging/deploy/maven2): repository.apache.org:443 failed to respond -> [Help 1]
        [INFO] [ERROR]
        [INFO] [ERROR] To see the full stack trace of the errors, re-run Maven with the -e switch.
        [INFO] [ERROR] Re-run Maven using the -X switch to enable full debug logging.
        [INFO] [ERROR]
        [INFO] [ERROR] For more information about the errors and possible solutions, please read the following articles:
        [INFO] [ERROR] [Help 1] http://cwiki.apache.org/confluence/display/MAVEN/MojoExecutionException
        ...
        {code}

        Show
        elecharny Emmanuel Lecharny added a comment - Reporter The issue has been closed, but the problem has *not* been fixed. I still have random failures, like : {code} ... [INFO] Uploaded: https://repository.apache.org/service/local/staging/deploy/maven2/org/apache/directory/api/api-asn1-api/1.0.0-M28/api-asn1-api-1.0.0-M28.pom (3 KB at 3.1 KB/sec) [INFO] [INFO] ------------------------------------------------------------------------ [INFO] [INFO] Reactor Summary: [INFO] [INFO] [INFO] [INFO] Apache Directory LDAP API .......................... SUCCESS [ 10.041 s] [INFO] [INFO] Apache Directory LDAP API I18n ..................... SUCCESS [ 13.459 s] [INFO] [INFO] Apache Directory LDAP API Utilities ................ SUCCESS [ 17.582 s] [INFO] [INFO] Apache Directory API ASN.1 Parent .................. SUCCESS [ 3.564 s] [INFO] [INFO] Apache Directory API ASN.1 API ..................... FAILURE [ 5.917 s] [INFO] [INFO] Apache Directory API ASN.1 BER ..................... SKIPPED [INFO] [INFO] Apache Directory LDAP API Parent ................... SKIPPED [INFO] [INFO] Apache Directory LDAP API Model .................... SKIPPED [INFO] [INFO] Apache Directory LDAP API Codec Parent ............. SKIPPED [INFO] [INFO] Apache Directory LDAP API Codec Core ............... SKIPPED [INFO] [INFO] Apache Directory LDAP API Net Parent ............... SKIPPED [INFO] [INFO] Apache Directory LDAP API Network MINA ............. SKIPPED [INFO] [INFO] Apache Directory LDAP API Extras ................... SKIPPED [INFO] [INFO] Apache Directory LDAP API Extras Codec API ......... SKIPPED [INFO] [INFO] Apache Directory LDAP API Extras Codec ............. SKIPPED [INFO] [INFO] Apache Directory LDAP API Codec Standalone ......... SKIPPED [INFO] [INFO] Apache Directory LDAP API DSML Parent .............. SKIPPED [INFO] [INFO] Apache Directory LDAP API DSML Parser .............. SKIPPED [INFO] [INFO] Apache Directory LDAP API Extras ACI ............... SKIPPED [INFO] [INFO] Apache Directory LDAP API Schema Parent ............ SKIPPED [INFO] [INFO] Apache Directory LDAP API Schema Data .............. SKIPPED [INFO] [INFO] Apache Directory LDAP API Client Parent ............ SKIPPED [INFO] [INFO] Apache Directory LDAP API Client API ............... SKIPPED [INFO] [INFO] Apache Directory LDAP API DSML Engine .............. SKIPPED [INFO] [INFO] Apache Directory LDAP API Extras Util .............. SKIPPED [INFO] [INFO] Apache Directory LDAP API Extras Stored Procedures . SKIPPED [INFO] [INFO] Apache Directory LDAP API Extras Trigger ........... SKIPPED [INFO] [INFO] Apache Directory LDAP API Schema Converter ......... SKIPPED [INFO] [INFO] Apache Directory API All ........................... SKIPPED [INFO] [INFO] Apache Directory LDAP API Client All ............... SKIPPED [INFO] [INFO] Apache Directory API Integration Tests ............. SKIPPED [INFO] [INFO] Apache Directory API OSGi Integration Tests ........ SKIPPED [INFO] [INFO] Apache Directory LDAP API Distribution ............. SKIPPED [INFO] [INFO] ------------------------------------------------------------------------ [INFO] [INFO] BUILD FAILURE [INFO] [INFO] ------------------------------------------------------------------------ [INFO] [INFO] Total time: 52.145 s [INFO] [INFO] Finished at: 2015-01-09T01:45:54+01:00 [INFO] [INFO] Final Memory: 44M/247M [INFO] [INFO] ------------------------------------------------------------------------ [INFO] [ERROR] Failed to execute goal org.apache.maven.plugins:maven-deploy-plugin:2.8.2:deploy (default-deploy) on project api-asn1-api: Failed to deploy artifacts: Could not transfer artifact org.apache.directory.api:api-asn1-api:jar:1.0.0-M28 from/to apache.releases.https ( https://repository.apache.org/service/local/staging/deploy/maven2): repository.apache.org:443 failed to respond -> [Help 1] [INFO] [ERROR] [INFO] [ERROR] To see the full stack trace of the errors, re-run Maven with the -e switch. [INFO] [ERROR] Re-run Maven using the -X switch to enable full debug logging. [INFO] [ERROR] [INFO] [ERROR] For more information about the errors and possible solutions, please read the following articles: [INFO] [ERROR] [Help 1] http://cwiki.apache.org/confluence/display/MAVEN/MojoExecutionException ... {code}
        Hide
        elecharny Emmanuel Lecharny added a comment - Reporter
        And another failure ...

        [ERROR] Failed to execute goal org.apache.maven.plugins:maven-deploy-plugin:2.8.2:deploy (default-deploy) on project api-i18n: Failed to deploy artifacts: Could not transfer artifact org.apache.directory.api:api-i18n:jar:1.0.0-M28 from/to apache.releases.https (https://repository.apache.org/service/local/staging/deploy/maven2): repository.apache.org:443 failed to respond -> [Help 1]
        Show
        elecharny Emmanuel Lecharny added a comment - Reporter And another failure ... [ERROR] Failed to execute goal org.apache.maven.plugins:maven-deploy-plugin:2.8.2:deploy (default-deploy) on project api-i18n: Failed to deploy artifacts: Could not transfer artifact org.apache.directory.api:api-i18n:jar:1.0.0-M28 from/to apache.releases.https ( https://repository.apache.org/service/local/staging/deploy/maven2): repository.apache.org:443 failed to respond -> [Help 1]
        Hide
        elecharny Emmanuel Lecharny added a comment - Reporter
        Another :
        [ERROR] Failed to execute goal org.apache.maven.plugins:maven-deploy-plugin:2.8.2:deploy (default-deploy) on project api-ldap-schema-converter: Failed to deploy artifacts: Could not transfer artifact org.apache.directory.api:api-ldap-schema-converter:jar:1.0.0-M28 from/to apache.releases.https (https://repository.apache.org/service/local/staging/deploy/maven2): repository.apache.org:443 failed to respond -> [Help 1]
        [ERROR]
        Show
        elecharny Emmanuel Lecharny added a comment - Reporter Another : [ERROR] Failed to execute goal org.apache.maven.plugins:maven-deploy-plugin:2.8.2:deploy (default-deploy) on project api-ldap-schema-converter: Failed to deploy artifacts: Could not transfer artifact org.apache.directory.api:api-ldap-schema-converter:jar:1.0.0-M28 from/to apache.releases.https ( https://repository.apache.org/service/local/staging/deploy/maven2): repository.apache.org:443 failed to respond -> [Help 1] [ERROR]
        Hide
        elecharny Emmanuel Lecharny added a comment - Reporter
        Keep failing :
        [ERROR] Failed to execute goal org.apache.maven.plugins:maven-deploy-plugin:2.8.2:deploy (default-deploy) on project api-all: Failed to deploy artifacts: Could not transfer artifact org.apache.directory.api:api-all:jar:1.0.0-M28 from/to apache.releases.https (https://repository.apache.org/service/local/staging/deploy/maven2): repository.apache.org:443 failed to respond -> [Help 1]
        Show
        elecharny Emmanuel Lecharny added a comment - Reporter Keep failing : [ERROR] Failed to execute goal org.apache.maven.plugins:maven-deploy-plugin:2.8.2:deploy (default-deploy) on project api-all: Failed to deploy artifacts: Could not transfer artifact org.apache.directory.api:api-all:jar:1.0.0-M28 from/to apache.releases.https ( https://repository.apache.org/service/local/staging/deploy/maven2): repository.apache.org:443 failed to respond -> [Help 1]
        Hide
        elecharny Emmanuel Lecharny added a comment - Reporter
        Note that I'm using the workaround shown above (cd target/checkout;mvn clean deploy -Papache-release -rf:<failed project>.

        I hope the various failures I reported might help to check the logs to see what could have gone wrong...
        Show
        elecharny Emmanuel Lecharny added a comment - Reporter Note that I'm using the workaround shown above (cd target/checkout;mvn clean deploy -Papache-release -rf:<failed project>. I hope the various failures I reported might help to check the logs to see what could have gone wrong...
        Hide
        ipv6guru Gavin added a comment -
        [~elecharny] due to recent changes, do you think this is no longer an issue?
        Show
        ipv6guru Gavin added a comment - [~elecharny] due to recent changes, do you think this is no longer an issue?
        Hide
        elecharny Emmanuel Lecharny added a comment - Reporter
        I'll tell you very soon : we are going to cut an ApacheDS release next week. I cut a LDAP API release today, seems like it worked.

        FTR, what has changed recently ?
        Show
        elecharny Emmanuel Lecharny added a comment - Reporter I'll tell you very soon : we are going to cut an ApacheDS release next week. I cut a LDAP API release today, seems like it worked. FTR, what has changed recently ?
        Hide
        infrabot #asfinfra Bot added a comment -
        Hi,

        This issue has not been updated for at least 3 days, and is being marked as 'Pending Closed'.
          
        In 5 days this issue will be automatically closed if no further updates are received.


        --
        Cheers,
        Apache Infrastructure Team
        Show
        infrabot #asfinfra Bot added a comment - Hi, This issue has not been updated for at least 3 days, and is being marked as 'Pending Closed'.    In 5 days this issue will be automatically closed if no further updates are received. -- Cheers, Apache Infrastructure Team
        Hide
        elecharny Emmanuel Lecharny added a comment - Reporter
        Re-opening.

        Without action, closing this JIRA will not help...

        I still get some errors while releasing, as with almsot any release I cut in the past 12 months :

        ...
        [INFO] [INFO] ------------------------------------------------------------------------
        [INFO] [INFO] BUILD FAILURE
        [INFO] [INFO] ------------------------------------------------------------------------
        [INFO] [INFO] Total time: 01:17 min
        [INFO] [INFO] Finished at: 2015-04-28T14:01:30+02:00
        [INFO] [INFO] Final Memory: 45M/247M
        [INFO] [INFO] ------------------------------------------------------------------------
        [INFO] [ERROR] Failed to execute goal org.apache.maven.plugins:maven-deploy-plugin:2.8.2:deploy (default-deploy) on project api-asn1-ber: Failed to deploy artifacts: Could not transfer artifact org.apache.directory.api:api-asn1-ber:jar:1.0.0-M30 from/to apache.releases.https (https://repository.apache.org/service/local/staging/deploy/maven2): repository.apache.org:443 failed to respond -> [Help 1]
        Show
        elecharny Emmanuel Lecharny added a comment - Reporter Re-opening. Without action, closing this JIRA will not help... I still get some errors while releasing, as with almsot any release I cut in the past 12 months : ... [INFO] [INFO] ------------------------------------------------------------------------ [INFO] [INFO] BUILD FAILURE [INFO] [INFO] ------------------------------------------------------------------------ [INFO] [INFO] Total time: 01:17 min [INFO] [INFO] Finished at: 2015-04-28T14:01:30+02:00 [INFO] [INFO] Final Memory: 45M/247M [INFO] [INFO] ------------------------------------------------------------------------ [INFO] [ERROR] Failed to execute goal org.apache.maven.plugins:maven-deploy-plugin:2.8.2:deploy (default-deploy) on project api-asn1-ber: Failed to deploy artifacts: Could not transfer artifact org.apache.directory.api:api-asn1-ber:jar:1.0.0-M30 from/to apache.releases.https ( https://repository.apache.org/service/local/staging/deploy/maven2): repository.apache.org:443 failed to respond -> [Help 1]
        Hide
        elecharny Emmanuel Lecharny added a comment - Reporter
        Any update on this issue ? Has any investigation been made ?

        This problem is not going to vanish...
        Show
        elecharny Emmanuel Lecharny added a comment - Reporter Any update on this issue ? Has any investigation been made ? This problem is not going to vanish...
        Hide
        ipv6guru Gavin added a comment -
        [~brianf] any ideas?
        Show
        ipv6guru Gavin added a comment - [~brianf] any ideas?
        Hide
        seelmann Stefan Seelmann added a comment -
        I had the same problem today when releasing Apache Directory Studio. After some googleing I found INFRA-7812, where Robert suggest to use the "retryFailedDeploymentCount" parameter of the maven-deploy-plugin, see https://maven.apache.org/plugins/maven-deploy-plugin/deploy-mojo.html#retryFailedDeploymentCount. With "-DretryFailedDeploymentCount=3" the release finally worked.

        [~elecharny] I think we can add this parameter to the maven-deploy-plugin configuration in the project pom?
        Show
        seelmann Stefan Seelmann added a comment - I had the same problem today when releasing Apache Directory Studio. After some googleing I found INFRA-7812 , where Robert suggest to use the "retryFailedDeploymentCount" parameter of the maven-deploy-plugin, see https://maven.apache.org/plugins/maven-deploy-plugin/deploy-mojo.html#retryFailedDeploymentCount . With "-DretryFailedDeploymentCount=3" the release finally worked. [~elecharny] I think we can add this parameter to the maven-deploy-plugin configuration in the project pom?
        Hide
        brianf Brian Fox added a comment -
        Is this only happening on directory deploys? The last 2 reports seem to be for the same project. This is almost certainly a function of size and upload speed causing a timeout in the reverse proxy.
        Show
        brianf Brian Fox added a comment - Is this only happening on directory deploys? The last 2 reports seem to be for the same project. This is almost certainly a function of size and upload speed causing a timeout in the reverse proxy.
        Hide
        dashorst Martijn Dashorst added a comment -
        It has happened to Wicket as well. I've since updated my pom to retry:

        <plugin>
        <groupId>org.apache.maven.plugins</groupId>
        <artifactId>maven-deploy-plugin</artifactId>
        <version>2.8.2</version>
        <configuration>
        <retryFailedDeploymentCount>10</retryFailedDeploymentCount>
        </configuration>
        </plugin>

        and this at least allows us to complete the release, but doesn't address the issue of connections being reset server-side.
        Show
        dashorst Martijn Dashorst added a comment - It has happened to Wicket as well. I've since updated my pom to retry: <plugin> <groupId>org.apache.maven.plugins</groupId> <artifactId>maven-deploy-plugin</artifactId> <version>2.8.2</version> <configuration> <retryFailedDeploymentCount>10</retryFailedDeploymentCount> </configuration> </plugin> and this at least allows us to complete the release, but doesn't address the issue of connections being reset server-side.
        Hide
        dashorst Martijn Dashorst added a comment -
        Perhaps this buildbot error is enlightning?

        [INFO] ------------------------------------------------------------------------
        [INFO] BUILD FAILURE
        [INFO] ------------------------------------------------------------------------
        [INFO] Total time: 26:18 min
        [INFO] Finished at: 2015-08-15T14:06:59+00:00
        [INFO] Final Memory: 41M/224M
        [INFO] ------------------------------------------------------------------------
        [ERROR] Failed to execute goal org.apache.maven.plugins:maven-deploy-plugin:2.8.2:deploy (default-deploy) on project wicket-util: Failed to deploy artifacts: Could not transfer artifact org.apache.wicket:wicket-util:jar:7.1.0-20150815.134627-22 from/to apache.snapshots.https (https://repository.apache.org/content/repositories/snapshots): Failed to transfer file: https://repository.apache.org/content/repositories/snapshots/org/apache/wicket/wicket-util/7.1.0-SNAPSHOT/wicket-util-7.1.0-20150815.134627-22.jar. Return code is: 502, ReasonPhrase: Proxy Error. -> [Help 1]
        Show
        dashorst Martijn Dashorst added a comment - Perhaps this buildbot error is enlightning? [INFO] ------------------------------------------------------------------------ [INFO] BUILD FAILURE [INFO] ------------------------------------------------------------------------ [INFO] Total time: 26:18 min [INFO] Finished at: 2015-08-15T14:06:59+00:00 [INFO] Final Memory: 41M/224M [INFO] ------------------------------------------------------------------------ [ERROR] Failed to execute goal org.apache.maven.plugins:maven-deploy-plugin:2.8.2:deploy (default-deploy) on project wicket-util: Failed to deploy artifacts: Could not transfer artifact org.apache.wicket:wicket-util:jar:7.1.0-20150815.134627-22 from/to apache.snapshots.https ( https://repository.apache.org/content/repositories/snapshots): Failed to transfer file: https://repository.apache.org/content/repositories/snapshots/org/apache/wicket/wicket-util/7.1.0-SNAPSHOT/wicket-util-7.1.0-20150815.134627-22.jar . Return code is: 502, ReasonPhrase: Proxy Error. -> [Help 1]
        Hide
        coreyg Geoffrey Corey added a comment -
        Is this still an issue?
        Show
        coreyg Geoffrey Corey added a comment - Is this still an issue?
        Hide
        elecharny Emmanuel Lecharny added a comment - Reporter
        Seems that it works fine. I cut 3 releases last week, one which was quite long, and I was not hit by this problem.

        I'll close it, expecting not to have to reopen it :-)
        Show
        elecharny Emmanuel Lecharny added a comment - Reporter Seems that it works fine. I cut 3 releases last week, one which was quite long, and I was not hit by this problem. I'll close it, expecting not to have to reopen it :-)
        Hide
        elecharny Emmanuel Lecharny added a comment - Reporter
        Seems that the issue is 'solved' (no idea what was the cause, or the fix for it...)
        Show
        elecharny Emmanuel Lecharny added a comment - Reporter Seems that the issue is 'solved' (no idea what was the cause, or the fix for it...)

          People

          • Assignee:
            brianf Brian Fox
            Reporter:
            elecharny Emmanuel Lecharny
            Request participants:
            None
          • Votes:
            1 Vote for this issue
            Watchers:
            10 Start watching this issue

            Dates

            • Created:
              Updated:
              Resolved: